{"text_format":"3","workbook":"xlsx","n_sheets":4,"sheets":["iaith - language","Text","queryformround1","2026-27 Settlement data"],"not_rendered":{"defined_names":12,"comments":1},"read":"whole","date_system":"1900"}

{"sheet":"iaith - language","index":0,"n_rows":6,"n_cols":12,"rows_kept":6,"hidden":true}
[1,{"$nulls":9},1,"Cymraeg/Welsh"]
[{"$nulls":11},"Saesneg/English"]
[{"$nulls":11},"Dewiswch os gwelwch yn dda / Please select"]
[{"$f":"IF('iaith - language'!$K$1=3,\"\", IF('iaith - language'!$K$1=2,VLOOKUP(A1,Text!$A$2:$C$366,2,0),VLOOKUP(A1,Text!$A$2:$C$366,3,0)))","v":"Proses wirio data Cylch 1 - data i'w defnyddio ar gyfer Setliad 2026-27"}]
[]
["Dewiswch iaith / Choose your preferred language:"]

{"sheet":"Text","index":1,"n_rows":242,"n_cols":6,"rows_kept":242,"hidden":true,"merged":[[0,9,0,10]]}
[null,"English","Welsh"]
[1,"Round 1 Data verification process - data for use in the 2026-27 Settlement","Proses wirio data Cylch 1 - data i'w defnyddio ar gyfer Setliad 2026-27"]
[2,"Round 1 data verification process","Proses gwiriad data cylch 1"]
[3,"Please select your authority name:","Dewiswch enw eich awdurdod:"]
[4,"Pupils at Independent schools ","Disgyblion mewn ysgolion annibynnol"]
[5,"You are requested to notify us of any pupils educated in independent schools for pupils without statements of special educational need (excluding special schools) ","Gofynnir ichi roi gwybod inni am unrhyw ddisgyblion sy'n cael eu haddysgu mewn ysgolion annibynnol ar gyfer disgyblion nad ydynt ar ddatganiad anghenion addysgol arbennig (ac eithrio ysgolion arbennig)"]
[6,"for whom your authority pays full tuition fees as recorded on line 1.3.5 on the Section 52 outturn return. This information should be provided in respect of the position at April 2024.","y mae eich awdurdod yn talu ffïoedd dysgu llawn ar eu cyfer, fel sydd wedi'i gofnodi ar llinell 1.3.5 o adroddiad alldro Adran 52. Dylid darparu'r wybodaeth hon ar gyfer y sefyllfa fel yr oedd ym mis Ebrill 2024."]
[7,"These pupils are directly credited in the SSAs and it is therefore very important that this information is provided to ensure the accuracy of the calculations. ","Rhoddir credyd yn uniongyrchol ar gyfer y disgyblion hyn yn yr Asesiadau o Wariant Safonol, felly mae'n bwysig iawn fod yr wybodaeth hon yn cael ei darparu er mwyn sicrhau bod y cyfrifiadau'n gywir. "]
[8,"Please provide the figures to us in the table below. Note that it will be assumed that there are no such pupils unless otherwise indicated. ","Darparwch y ffigurau inni yn y tabl isod. Sylwch y cymerir yn ganiataol nad oes disgyblion o'r fath os na ddywedir yn wahanol. "]
[9,"Data set","Set ddata"]
[10,"Pupils in N2 or reception year groups in nursery or primary schools","Disgyblion mewn grwpiau blwyddyn meithrin 2 neu flwyddyn derbyn mewn ysgolion meithrin neu gynradd"]
[11,"Primary school pupils in year groups 1 and above","Disgyblion ysgol gynradd yng ngrwpiau blwyddyn 1 ac uwch"]
[12,"Secondary school pupils in year groups 10 and 11","Disgyblion ysgol uwchradd yng ngrwpiau blwyddyn 10 ac 11"]
[13,"Secondary school pupils in year groups 7-11","Disgyblion ysgol uwchradd yng ngrwpiau blwyddyn 7-11"]
[14,"Secondary school pupils in year groups 12-14","Disgyblion ysgol uwchradd yng ngrwpiau blwyddyn 12-14"]
{"$rows_left_out":228}
{"sheet":"queryformround1","index":2,"n_rows":179,"n_cols":11,"rows_kept":179,"merged":[[5,2,5,8],[6,2,6,8],[7,2,7,8],[12,2,13,2],[12,3,13,3],[12,4,13,4],[12,5,13,5],[12,6,13,6],[35,8,37,8],[91,3,92,3],[116,8,121,8],[122,2,123,2],[124,2,173,2],[124,3,148,3],[149,3,173,3]]}
[2,null,{"$f":"IF('iaith - language'!K1=2,VLOOKUP(A1,Text!A3:C316,2),VLOOKUP(A1,Text!A3:C318,3))","v":"Proses gwiriad data cylch 1"}]
[]
[3,null,{"$f":"IF('iaith - language'!K1=2,VLOOKUP(A3,Text!A3:C316,2),VLOOKUP(A3,Text!A3:C318,3))","v":"Dewiswch enw eich awdurdod:"}]
[]
[]
[15,null,{"$f":"IF('iaith - language'!K1=2,VLOOKUP(A6,Text!A3:C316,2),VLOOKUP(A6,Text!A3:C318,3))","v":"Defnyddir y data heb fod yn ariannol, a gasglwyd yn wreiddiol gan Awdurdodau Lleol, i gyfrifo Asesiadau o Wariant Safonol (SSAs) yn y Setliad Llywodraeth Leol. "}]
[16,null,{"$f":"IF('iaith - language'!K1=2,VLOOKUP(A7,Text!A3:C316,2),VLOOKUP(A7,Text!A3:C318,3))","v":"Mae'r data hyn eisoes wedi bod drwy amryw o brosesau sicrhau ansawdd a gwirio cyn iddynt gael eu cyhoeddi."}]
[17,null,{"$f":"IF('iaith - language'!K1=2,VLOOKUP(A8,Text!A3:C316,2),VLOOKUP(A8,Text!A3:C318,3))","v":"Ni ddylid defnyddio’r broses wirio hon i roi sylw i amcangyfrifon sydd wedi eu cyhoeddi os yw’r newidiadau dan sylw yn rhai mân. Yn hytrach, nod y broses yw sicrhau bod unrhyw gamgymeriadau sylweddol yn y data heb fod yn ariannol, neu newidiadau o bwys iddynt, yn cael eu nodi cyn cyhoeddi'r Setliad Llywodraeth Leol. "}]
[]
[18,null,{"$f":"IF('iaith - language'!$K$1=2,VLOOKUP(A10,Text!$A$3:$C$402,2,0),VLOOKUP(A10,Text!$A$3:$C$402,3,0))","v":"Ffurflen ymholiadau ar gyfer sylwadau ar y data"}]
[]
[{"$nulls":4},20,21,22,23,25]
[19,null,{"$f":"IF('iaith - language'!$K$1=2,VLOOKUP(A13,Text!$A$3:$C$402,2,0),VLOOKUP(A13,Text!$A$3:$C$402,3,0))","v":"Pwnc"},{"$f":"IF('iaith - language'!$K$1=2,VLOOKUP(A14,Text!$A$3:$C$402,2,0),VLOOKUP(#REF!,Text!$A$3:$C$402,3,0))","v":{"$error":"#REF!"}},{"$f":"IF('iaith - language'!$K$1=2,VLOOKUP(E12,Text!$A$3:$C$402,2,0),VLOOKUP(E12,Text!$A$3:$C$402,3,0))","v":"Pwynt data"},{"$f":"IF('iaith - language'!$K$1=2,VLOOKUP(F12,Text!$A$3:$C$402,2,0),VLOOKUP(F12,Text!$A$3:$C$402,3,0))","v":"Ffigur gwiriad"},{"$f":"IF('iaith - language'!K1=2,VLOOKUP(G12,Text!A3:C316,2),VLOOKUP(G12,Text!A3:C318,3))","v":"Ystorfa Ddata"},{"$f":"IF('iaith - language'!K1=2,VLOOKUP(H12,Text!A3:C316,2),VLOOKUP(H12,Text!A3:C318,3))","v":"Ffigur diwygiedig"},{"$f":"IF('iaith - language'!K1=2,VLOOKUP(I12,Text!A3:C316,2),VLOOKUP(I12,Text!A3:C318,3))","v":"Sylwadau/Ymholiadau"},24]
[9,{"$nulls":6},{"$f":"IF('iaith - language'!K1=2,VLOOKUP(J13,Text!A3:C316,2),VLOOKUP(J13,Text!A3:C318,3))","v":"Dim ond os cytunwyd gan yr ystorfa ddata"},{"$f":"IF('iaith - language'!K1=2,VLOOKUP(J14,Text!A3:C316,2),VLOOKUP(J14,Text!A3:C318,3))","v":"Os ydych chi wedi cael cytundeb yr ystorfa ddata berthnasol i ddiwygio eich data cyhoeddedig, rhowch fanylion "},26]
[38,51,{"$f":"IF('iaith - language'!$K$1=2,VLOOKUP(A15,Text!$A$3:$C$402,2,0),VLOOKUP(A15,Text!$A$3:$C$402,3,0))","v":"CEISIADAU CYNLLUNIO"},{"$f":"IF('iaith - language'!$K$1=2,VLOOKUP(B15,Text!$A$3:$C$402,2,0),VLOOKUP(B15,Text!$A$3:$C$402,3,0))","v":"Ceisiadau Cynllunio a Gafwyd"},{"$f":"'2026-27 Settlement data'!D7","v":"2024-06-01"},{"$f":"VLOOKUP(Text!$F$130,'2026-27 Settlement data'!$B$9:$DG$30,$K15,FALSE)","v":{"$error":"#N/A"}},{"$f":"IF('iaith - language'!K1=2,VLOOKUP(A17,Text!A3:C316,2),VLOOKUP(A17,Text!A3:C318,3))","v":"Llywodraeth Cymru"},null,null,109,3]
{"$rows_left_out":165}
{"sheet":"2026-27 Settlement data","index":3,"n_rows":41,"n_cols":163,"rows_kept":41,"hidden":true,"merged":[[5,3,5,6],[5,41,5,51],[5,52,5,55],[5,56,5,59],[5,60,5,63],[5,64,5,67],[5,68,5,71],[5,72,5,75],[5,76,5,79],[5,80,5,83],[5,84,5,87],[5,88,5,91],[5,92,5,95],[5,96,5,99],[5,100,5,103],[5,113,5,137],[5,138,5,162]]}
[null,600,{"$f":"IF('iaith - language'!$K$1=2,VLOOKUP(B1,Text!$A$1:$C$353,2,FALSE),VLOOKUP(B1,Text!$A$1:$C$353,3,FALSE))","v":"Proses wirio data Cylch 1 - data i'w defnyddio ar gyfer Setliad 2026-27"}]
[]
[{"$nulls":3},51,{"$nulls":3},61,62,67,68,69,70,71,72,73,74,75,76,77,78,79,80,81,82,83,84,86,90,91,92,145,147,143,149,151,152,152.5,160,162,163,192,{"$nulls":10},194,{"$nulls":3},195,{"$nulls":3},196,{"$nulls":3},197,{"$nulls":3},198,{"$nulls":3},199,{"$nulls":3},200,{"$nulls":3},201,{"$nulls":3},202,{"$nulls":3},203,{"$nulls":3},204,{"$nulls":3},205,{"$nulls":3},206,{"$nulls":3},271.5,53,55,57,54,56,58]
[{"$nulls":3},601,{"$f":"D4+1","v":602},{"$f":"E4+1","v":603},{"$f":"F4+1","v":604},{"$f":"G4+1","v":605},605,{"$nulls":20},605,null,604,604,606,{"$nulls":7},607,{"$f":"AP4+1","v":608},{"$f":"AQ4+1","v":609},{"$f":"AR4+1","v":610},{"$f":"AS4+1","v":611},604,606,605,612,{"$f":"AX4+1","v":613},{"$f":"AY4+1","v":614},615,616,608,611,{"$f":"BA4","v":615},616,608,611,615,616,608,611,615,616,608,611,615,616,608,611,615,616,608,611,615,616,608,611,615,616,608,611,615,616,608,611,615,616,608,611,615,616,608,611,615,616,608,611,615,616,608,611,{"$f":"G4","v":604},604,604,604,604,604,604]
[]
[{"$nulls":3},{"$f":"IF('iaith - language'!$K$1=2,VLOOKUP(D3,Text!$A$3:$C$353,2,FALSE),VLOOKUP(D3,Text!$A$3:$C$353,3,FALSE))","v":"Ceisiadau Cynllunio a Gafwyd"},{"$nulls":3},{"$f":"IF('iaith - language'!$K$1=2,VLOOKUP(H3,Text!$A$3:$C$353,2,FALSE),VLOOKUP(H3,Text!$A$3:$C$353,3,FALSE))","v":"Stoc anheddau'r sector preifat"},{"$f":"IF('iaith - language'!$K$1=2,VLOOKUP(I3,Text!$A$3:$C$353,2,FALSE),VLOOKUP(I3,Text!$A$3:$C$353,3,FALSE))","v":"Arwynebedd tir (hectarau)"},{"$f":"IF('iaith - language'!$K$1=2,VLOOKUP(J3,Text!$A$3:$C$353,2,FALSE),VLOOKUP(J3,Text!$A$3:$C$353,3,FALSE))","v":"Cyfanswm y boblogaeth"},{"$f":"IF('iaith - language'!$K$1=2,VLOOKUP(K3,Text!$A$3:$C$353,2,FALSE),VLOOKUP(K3,Text!$A$3:$C$353,3,FALSE))","v":"Poblogaeth 3 oed "},{"$f":"IF('iaith - language'!$K$1=2,VLOOKUP(L3,Text!$A$3:$C$353,2,FALSE),VLOOKUP(L3,Text!$A$3:$C$353,3,FALSE))","v":"Poblogaeth 3 i 11 oed"},{"$f":"IF('iaith - language'!$K$1=2,VLOOKUP(M3,Text!$A$3:$C$353,2,FALSE),VLOOKUP(M3,Text!$A$3:$C$353,3,FALSE))","v":"Poblogaeth 3 i 16 oed "},{"$f":"IF('iaith - language'!$K$1=2,VLOOKUP(N3,Text!$A$3:$C$353,2,FALSE),VLOOKUP(N3,Text!$A$3:$C$353,3,FALSE))","v":"Poblogaeth 11 i 15 oed "},{"$f":"IF('iaith - language'!$K$1=2,VLOOKUP(O3,Text!$A$3:$C$353,2,FALSE),VLOOKUP(O3,Text!$A$3:$C$353,3,FALSE))","v":"Poblogaeth 11 i 20 oed "},{"$f":"IF('iaith - language'!$K$1=2,VLOOKUP(P3,Text!$A$3:$C$353,2,FALSE),VLOOKUP(P3,Text!$A$3:$C$353,3,FALSE))","v":"Poblogaeth 16 oed a throsodd "},{"$f":"IF('iaith - language'!$K$1=2,VLOOKUP(Q3,Text!$A$3:$C$353,2,FALSE),VLOOKUP(Q3,Text!$A$3:$C$353,3,FALSE))","v":"Poblogaeth 16 i 18 oed "},{"$f":"IF('iaith - language'!$K$1=2,VLOOKUP(R3,Text!$A$3:$C$353,2,FALSE),VLOOKUP(R3,Text!$A$3:$C$353,3,FALSE))","v":"Poblogaeth 0 i 17 oed "},{"$f":"IF('iaith - language'!$K$1=2,VLOOKUP(S3,Text!$A$3:$C$353,2,FALSE),VLOOKUP(S3,Text!$A$3:$C$353,3,FALSE))","v":"Poblogaeth 18 i 64 oed "},{"$f":"IF('iaith - language'!$K$1=2,VLOOKUP(T3,Text!$A$3:$C$353,2,FALSE),VLOOKUP(T3,Text!$A$3:$C$353,3,FALSE))","v":"Poblogaeth 18 oed a throsodd "},{"$f":"IF('iaith - language'!$K$1=2,VLOOKUP(U3,Text!$A$3:$C$353,2,FALSE),VLOOKUP(U3,Text!$A$3:$C$353,3,FALSE))","v":"Poblogaeth o dan 60 oed "},{"$f":"IF('iaith - language'!$K$1=2,VLOOKUP(V3,Text!$A$3:$C$353,2,FALSE),VLOOKUP(V3,Text!$A$3:$C$353,3,FALSE))","v":"Poblogaeth 60 oed a throsodd"},{"$f":"IF('iaith - language'!$K$1=2,VLOOKUP(W3,Text!$A$3:$C$353,2,FALSE),VLOOKUP(W3,Text!$A$3:$C$353,3,FALSE))","v":"Poblogaeth 85 oed a throsodd "},{"$f":"IF('iaith - language'!$K$1=2,VLOOKUP(X3,Text!$A$3:$C$353,2,FALSE),VLOOKUP(X3,Text!$A$3:$C$353,3,FALSE))","v":"Poblogaeth oedran gweithio (16-65G/B) "},{"$f":"IF('iaith - language'!$K$1=2,VLOOKUP(Y3,Text!$A$3:$C$353,2,FALSE),VLOOKUP(Y3,Text!$A$3:$C$353,3,FALSE))","v":"Amcangyfrifon Poblogaeth Ganol Blwyddyn, pob oed"},{"$f":"IF('iaith - language'!$K$1=2,VLOOKUP(Z3,Text!$A$3:$C$353,2,FALSE),VLOOKUP(Z3,Text!$A$3:$C$353,3,FALSE))","v":"Amcangyfrifon Poblogaeth Ganol Blwyddyn, 18 oed a throsodd"},{"$f":"IF('iaith - language'!$K$1=2,VLOOKUP(AA3,Text!$A$3:$C$353,2,FALSE),VLOOKUP(AA3,Text!$A$3:$C$353,3,FALSE))","v":"Amcangyfrifon Poblogaeth Ganol Blwyddyn, 65 oed a throsodd"},{"$f":"IF('iaith - language'!$K$1=2,VLOOKUP(AB3,Text!$A$3:$C$353,2,FALSE),VLOOKUP(AB3,Text!$A$3:$C$353,3,FALSE))","v":"Swm a wariwyd ar grantiau cyfleusterau i'r anabl wedi'u cwblhau (£s)"},{"$f":"IF('iaith - language'!$K$1=2,VLOOKUP(AC3,Text!$A$3:$C$353,2,FALSE),VLOOKUP(AC3,Text!$A$3:$C$353,3,FALSE))","v":"Praeseptau Draenio Tir"},{"$f":"IF('iaith - language'!$K$1=2,VLOOKUP(AD3,Text!$A$3:$C$353,2,FALSE),VLOOKUP(AD3,Text!$A$3:$C$353,3,FALSE))","v":"Hyd yr arfordir a warchodir"},{"$f":"IF('iaith - language'!$K$1=2,VLOOKUP(AE3,Text!$A$3:$C$353,2,FALSE),VLOOKUP(AE3,Text!$A$3:$C$353,3,FALSE))","v":"Nifer y Ffermydd"},{"$f":"IF('iaith - language'!$K$1=2,VLOOKUP(AF3,Text!$A$3:$C$353,2,FALSE),VLOOKUP(AF3,Text!$A$3:$C$353,3,FALSE))","v":"Nifer yr Eiddo Masnachu"},{"$f":"IF('iaith - language'!$K$1=2,VLOOKUP(AG3,Text!$A$3:$C$353,2,FALSE),VLOOKUP(AG3,Text!$A$3:$C$353,3,FALSE))","v":"Nifer yr Eiddo Bwyd"},{"$f":"IF('iaith - language'!$K$1=2,VLOOKUP(AH3,Text!$A$3:$C$353,2,FALSE),VLOOKUP(AH3,Text!$A$3:$C$353,3,FALSE))","v":"Cyfanswm yr unedau goleuadau stryd"},{"$f":"IF('iaith - language'!$K$1=2,VLOOKUP(AI3,Text!$A$3:$C$353,2,FALSE),VLOOKUP(AI3,Text!$A$3:$C$353,3,FALSE))","v":"Nifer y marwolaethau wedi'u cofrestru"},{"$f":"IF('iaith - language'!$K$1=2,VLOOKUP(AJ3,Text!$A$3:$C$353,2,FALSE),VLOOKUP(AJ3,Text!$A$3:$C$353,3,FALSE))","v":"Llwyth achosion Cynlluniau Gostyngiadau'r Dreth Gyngor "},{"$f":"IF('iaith - language'!$K$1=2,VLOOKUP(AK3,Text!$A$3:$C$353,2,FALSE),VLOOKUP(AK3,Text!$A$3:$C$353,3,FALSE))","v":"Gwariant Cynlluniau Gostyngiadau'r Dreth Gyngor"},{"$f":"IF('iaith - language'!$K$1=2,VLOOKUP(AL3,Text!$A$3:$C$353,2,FALSE),VLOOKUP(AL3,Text!$A$3:$C$353,3,FALSE))","v":"Cefnogaeth CTRS Covid-19 "},{"$f":"IF('iaith - language'!$K$1=2,VLOOKUP(AM3,Text!$A$3:$C$353,2,FALSE),VLOOKUP(AM3,Text!$A$3:$C$353,3,FALSE))","v":"Nifer y llongau sy'n cyrraedd porthladdoedd"},{"$f":"IF('iaith - language'!$K$1=2,VLOOKUP(AN3,Text!$A$3:$C$353,2,FALSE),VLOOKUP(AN3,Text!$A$3:$C$353,3,FALSE))","v":"Nosweithiau twristiaid (miloedd) gan gynnwys AirBnb"},{"$f":"IF('iaith - language'!$K$1=2,VLOOKUP(AO3,Text!$A$3:$C$353,2,FALSE),VLOOKUP(AO3,Text!$A$3:$C$353,3,FALSE))","v":"Diwrnodau twristiaid (miloedd)"},{"$f":"IF('iaith - language'!$K$1=2,VLOOKUP(AP3,Text!$A$3:$C$353,2,FALSE),VLOOKUP(AP3,Text!$A$3:$C$353,3,FALSE))","v":"Data Hawlwyr Budd-dal "},{"$nulls":10},{"$f":"IF('iaith - language'!$K$1=2,VLOOKUP(BA3,Text!$A$3:$C$353,2,FALSE),VLOOKUP(BA3,Text!$A$3:$C$353,3,FALSE))","v":"Nifer yr Hawlwyr Cymhorthdal Incwm, 18-64 oed"},{"$nulls":3},{"$f":"IF('iaith - language'!$K$1=2,VLOOKUP(BE3,Text!$A$3:$C$353,2,FALSE),VLOOKUP(BE3,Text!$A$3:$C$353,3,FALSE))","v":"Nifer y Derbynwyr Lwfans Ceisio Swydd ar Sail Incwm, 18-64 oed"},{"$nulls":3},{"$f":"IF('iaith - language'!$K$1=2,VLOOKUP(BI3,Text!$A$3:$C$353,2,FALSE),VLOOKUP(BI3,Text!$A$3:$C$353,3,FALSE))","v":"Nifer yr hawlwyr Credyd Pensiwn, 18-64 oed"},{"$nulls":3},{"$f":"IF('iaith - language'!$K$1=2,VLOOKUP(BM3,Text!$A$3:$C$353,2,FALSE),VLOOKUP(BM3,Text!$A$3:$C$353,3,FALSE))","v":"Nifer y rhai sydd yn derbyn Credyd Cynhwysol (ddim mewn cyflogaeth) 18-64 oed"},{"$nulls":3},{"$f":"IF('iaith - language'!$K$1=2,VLOOKUP(BQ3,Text!$A$3:$C$353,2,FALSE),VLOOKUP(BQ3,Text!$A$3:$C$353,3,FALSE))","v":"Cyfanswm yr Hawlwyr Cymhorthdal Incwm"},{"$nulls":3},{"$f":"IF('iaith - language'!$K$1=2,VLOOKUP(BU3,Text!$A$3:$C$353,2,FALSE),VLOOKUP(BU3,Text!$A$3:$C$353,3,FALSE))","v":"Cyfanswm y Derbynwyr Lwfans Ceisio Swydd ar Sail Incwm"},{"$nulls":3},{"$f":"IF('iaith - language'!$K$1=2,VLOOKUP(BY3,Text!$A$3:$C$353,2,FALSE),VLOOKUP(BY3,Text!$A$3:$C$353,3,FALSE))","v":"Cyfanswm Hawlwyr Credyd Pensiwn"},{"$nulls":3},{"$f":"IF('iaith - language'!$K$1=2,VLOOKUP(CC3,Text!$A$3:$C$353,2,FALSE),VLOOKUP(CC3,Text!$A$3:$C$353,3,FALSE))","v":"Cyfanswm y rhai sy’n derbyn Credyd Cynhwysol (ddim mewn cyflogaeth)"},{"$nulls":3},{"$f":"IF('iaith - language'!$K$1=2,VLOOKUP(CG3,Text!$A$3:$C$353,2,FALSE),VLOOKUP(CG3,Text!$A$3:$C$353,3,FALSE))","v":"Nifer yr Hawlwyr Lwfans Anabledd Difrifol, 18-64 oed"},{"$nulls":3},{"$f":"IF('iaith - language'!$K$1=2,VLOOKUP(CK3,Text!$A$3:$C$353,2,FALSE),VLOOKUP(CK3,Text!$A$3:$C$353,3,FALSE))","v":"Nifer yr Hawlwyr Lwfans Byw i'r Anabl, 18-64 oed"},{"$nulls":3},{"$f":"IF('iaith - language'!$K$1=2,VLOOKUP(CO3,Text!$A$3:$C$353,2,FALSE),VLOOKUP(CO3,Text!$A$3:$C$353,3,FALSE))","v":"Nifer yr Hawlwyr Taliad Annibyniaeth Bersonol sydd yn 18-64 oed"},{"$nulls":3},{"$f":"IF('iaith - language'!$K$1=2,VLOOKUP(CS3,Text!$A$3:$C$353,2,FALSE),VLOOKUP(CS3,Text!$A$3:$C$353,3,FALSE))","v":"Hawlwyr Credyd Pensiwn, 65 oed a hŷn "},{"$nulls":3},{"$f":"IF('iaith - language'!$K$1=2,VLOOKUP(CW3,Text!$A$3:$C$353,2,FALSE),VLOOKUP(CW3,Text!$A$3:$C$353,3,FALSE))","v":"Cyfanswn yr hawlwyr Cymhorthdal Incwm, Lwfans Ceisio Gwaith, a Chredyd Pensiwn"},{"$nulls":3},{"$f":"IF('iaith - language'!$K$1=2,VLOOKUP(DA3,Text!$A$3:$C$353,2,FALSE),VLOOKUP(DA3,Text!$A$3:$C$353,3,FALSE))","v":"Stoc eiddo treth cyngor"},{"$f":"IF('iaith - language'!$K$1=2,VLOOKUP(DB3,Text!$A$3:$C$353,2,FALSE),VLOOKUP(DB3,Text!$A$3:$C$353,3,FALSE))","v":"Hyd ffyrdd A y sir (km)"},{"$f":"IF('iaith - language'!$K$1=2,VLOOKUP(DC3,Text!$A$3:$C$353,2,FALSE),VLOOKUP(DC3,Text!$A$3:$C$353,3,FALSE))","v":"Hyd ffyrdd B ac C (km)"},{"$f":"IF('iaith - language'!$K$1=2,VLOOKUP(DD3,Text!$A$3:$C$353,2,FALSE),VLOOKUP(DD3,Text!$A$3:$C$353,3,FALSE))","v":"Hyd is-ffyrdd â wyneb caled (km)"},{"$f":"IF('iaith - language'!$K$1=2,VLOOKUP(DE3,Text!$A$3:$C$353,2,FALSE),VLOOKUP(DE3,Text!$A$3:$C$353,3,FALSE))","v":"Hyd ffyrdd A y sir, adeiledig (km)"},{"$f":"IF('iaith - language'!$K$1=2,VLOOKUP(DF3,Text!$A$3:$C$353,2,FALSE),VLOOKUP(DF3,Text!$A$3:$C$353,3,FALSE))","v":"Hyd ffyrdd B ac C, adeiledig (km)"},{"$f":"IF('iaith - language'!$K$1=2,VLOOKUP(DG3,Text!$A$3:$C$353,2,FALSE),VLOOKUP(DG3,Text!$A$3:$C$353,3,FALSE))","v":"Hyd is-ffyrdd â wyneb caled, adeiledig (km)"},"Prevention of Homelessness by Area and Measure (Section 66)","Number of outcomes - Eligible, homeless, subject to duty to help to secure (Section 73)","Total number of households on Universal Credit (with housing entitlement and receiving payment) ",{"$nulls":24}," Total number of households receiving housing benefit"]
[null,0,null,45444,45536,45627,45717,44986,45413,"2024","2024","2024","2024","2024","2024","2024","2024","2024","2024","2024","2024","2024","2024","2024","2020","2020","2020","2018-19","2024-25",{"$f":"IF('iaith - language'!$K$1=2,VLOOKUP(AD$4,Text!$A$1:$C$458,2,FALSE),VLOOKUP(AD$4,Text!$A$1:$C$458,3,FALSE))","v":"Mai 2022"},"2021",45352,45352,45748,"2024","2023-24","2023-24","2021-22","2024","2019","2019",45566,45597,45627,45658,45689,45717,45748,45778,45809,45839,45870,45413,45505,45597,45689,45413,45505,45597,45689,45413,45505,45597,45689,45413,45505,45597,45689,45413,45505,45597,45689,45413,45505,45597,45689,45413,45505,45597,45689,45413,45505,45597,45689,45413,45505,45597,45689,45413,45505,45597,45689,45413,45505,45597,45689,45413,45505,45597,45689,45413,45505,45597,45689,45717,45383,45383,45383,45383,45383,45383,"2024-25","2024-25",45047,45078,45108,45139,45170,45200,45231,45261,45292,45323,45352,45383,45413,45444,45474,45505,45536,45566,45597,45627,45658,45689,45717,45748,45778,45047,45078,45108,45139,45170,45200,45231,45261,45292,45323,45352,45383,45413,45444,45474,45505,45536,45566,45597,45627,45658,45689,45717,45748,45778]
[]
[117,2,{"$f":"IF('iaith - language'!$K$1=2,VLOOKUP(A9,Text!$A$3:$C$353,2,FALSE),VLOOKUP(A9,Text!$A$3:$C$353,3,FALSE))","v":"Sir Ynys Môn"},181,187,171,205,"N/A",71519.94099999999,69097,595,6423,10553,4174,7408,57709,2236,12927,37221,56170,44624,24473,2455,39817,70440,57101,18639,null,4280.9,7.9,935,3510,1020,9984,934,5554,6029938,"N/A",2661,5514.022396125236,707.4918435630126,1450,1455,1475,1480,1500,1455,1410,1360,1340,1330,1335,132,52,19,8,88,100,78,55,0,0,0,0,3968,4102,4398,4715,131,55,19,13,92,100,77,61,2002,2008,2035,2036,4033,4175,4475,4801,0,0,0,0,63,65,61,60,3639,3730,3819,3861,2002,2008,2035,2036,2225,2163,2131,2110,36210,145.6,484.5,559.1,28.1,59.599999999999994,181.5,84,240,2805,2812,2843,2883,2920,2957,2982,2988,3002,3070,3120,3139,3208,3221,3289,3342,3402,3438,3494,3586,3640,3707,3717,3787,3831,2696,2653,2629,2605,2594,2579,2540,2552,2566,2545,2509,2504,2495,2455,2425,2391,2352,2303,2251,2225,2208,2150,2116,2103,2076]
[118,3,{"$f":"IF('iaith - language'!$K$1=2,VLOOKUP(A10,Text!$A$3:$C$353,2,FALSE),VLOOKUP(A10,Text!$A$3:$C$353,3,FALSE))","v":"Gwynedd"},238,231,287,225,"N/A",254857.43099999998,120813,1026,10534,17218,6697,14648,101819,4093,21618,70968,99195,83867,36946,3840,75130,125171,101957,28562,null,124710.76000000001,20.14,1822,8480,2500,13256,1420,8105,9552887,"N/A",1,20095.71004285075,3836.383671608743,2005,2045,2055,2145,2335,2230,2115,1980,1905,1850,1930,182,70,16,7,105,100,98,93,0,0,0,0,5703,6003,6292,6945,193,77,18,13,105,100,100,93,3318,3310,3384,3373,5771,6068,6377,7075,0,0,0,0,85,84,83,84,5298,5446,5611,5699,3318,3310,3384,3373,3616,3487,3502,3479,62730,341.6,1064.9,1323.3,74.6,104.30000000000001,346.9,51,339,4394,4392,4413,4381,4418,4438,4455,4524,4576,4629,4631,4686,4830,4911,4935,4995,5070,5145,5235,5343,5457,5603,5656,5707,5782,4272,4267,4223,4209,4175,4155,4141,4119,4102,4100,4025,4018,4027,4004,3960,3861,3781,3669,3581,3520,3496,3442,3390,3265,3212]
[119,4,{"$f":"IF('iaith - language'!$K$1=2,VLOOKUP(A11,Text!$A$3:$C$353,2,FALSE),VLOOKUP(A11,Text!$A$3:$C$353,3,FALSE))","v":"Conwy"},207,167,187,178,"N/A",113017.935,114891,974,9937,16353,6407,11707,97038,3645,20348,61992,94543,73024,41867,4428,66362,118184,97000,32938,null,44565.61,23.59,931,5470,2210,16754,1597,9607,11719670,"N/A",31,11135.436688486161,7219.659429750646,2500,2480,2460,2515,2585,2565,2440,2380,2345,2260,2275,229,86,28,13,144,124,114,119,0,0,0,0,6745,6992,7453,8191,229,82,29,13,151,130,118,120,3613,3610,3682,3717,6820,7059,7533,8288,0,0,0,0,110,99,98,93,6567,6712,6823,6914,3613,3610,3682,3717,3993,3822,3829,3850,58460,117.5,666.9,897.3,51.6,102.89999999999999,419.6,294,537,4655,4672,4706,4722,4785,4812,4850,4880,4911,4987,5024,5044,5175,5180,5274,5400,5485,5589,5685,5763,5815,5961,6021,6035,6166,4827,4786,4748,4724,4711,4709,4653,4606,4594,4585,4560,4553,4566,4502,4412,4339,4234,4145,4056,4000,3986,3887,3820,3714,3651]
[120,5,{"$f":"IF('iaith - language'!$K$1=2,VLOOKUP(A12,Text!$A$3:$C$353,2,FALSE),VLOOKUP(A12,Text!$A$3:$C$353,3,FALSE))","v":"Sir Ddinbych"},"-","-","-","-","N/A",83871.492,98202,954,9615,15647,5930,11006,81174,3478,19403,54156,78799,66057,32145,3162,57848,96664,77165,23517,null,null,9.4,761,4010,1630,11759,1313,8830,10841284,"N/A",0,7466.735467847676,4400.806284565748,2085,2105,2075,2110,2205,2170,2105,2035,1975,1980,1935,242,89,31,14,107,113,108,87,0,0,0,0,6491,6760,7206,7834,241,94,29,16,118,117,113,93,3013,3030,3073,3071,6583,6862,7297,7929,0,0,0,0,117,113,104,105,6692,6844,6987,7047,3013,3030,3073,3071,3372,3241,3215,3180,46760,139.8,655.3,623.4,29.7,49.9,222.2,84,354,4450,4432,4472,4515,4529,4559,4550,4618,4638,4693,4698,4715,4822,4916,4966,5042,5117,5203,5291,5389,5483,5617,5685,5742,5836,4299,4297,4262,4262,4245,4240,4224,4174,4162,4157,4145,4125,4120,4073,4025,3960,3773,3702,3636,3572,3521,3428,3343,3227,3164]
[121,6,{"$f":"IF('iaith - language'!$K$1=2,VLOOKUP(A13,Text!$A$3:$C$353,2,FALSE),VLOOKUP(A13,Text!$A$3:$C$353,3,FALSE))","v":"Sir y Fflint"},209,211,206,211,"N/A",43983.083999999995,155867,1555,14981,24557,9409,17657,129034,5648,30746,90669,125121,110348,45519,4151,96615,156847,124648,33294,null,null,2.76,519,5190,1680,21364,1650,10215,12297950,"N/A",1,3924.1983287717267,2929.6085719648577,2705,2690,2545,2640,2720,2750,2730,2645,2680,2700,2765,193,73,19,7,164,160,163,176,0,0,0,0,8633,8990,9245,9798,203,81,22,11,167,168,170,182,3424,3406,3491,3484,8675,9035,9305,9844,0,0,0,0,100,92,89,94,8142,8393,8587,8702,3424,3406,3491,3484,3794,3655,3683,3677,71710,157.4,340.5,690.6,64.1,111.2,435.9,456,633,6302,6303,6303,6325,6359,6423,6444,6478,6543,6607,6640,6694,6828,6874,6919,7009,7094,7170,7238,7330,7434,7567,7653,7690,7800,4622,4588,4573,4563,4442,4505,4402,4437,4448,4452,4423,4412,4400,4377,4301,4199,4104,4027,3901,3832,3869,3782,3791,3730,3649]
[122,7,{"$f":"IF('iaith - language'!$K$1=2,VLOOKUP(A14,Text!$A$3:$C$353,2,FALSE),VLOOKUP(A14,Text!$A$3:$C$353,3,FALSE))","v":"Wrecsam"},203,230,193,259,"N/A",50377.064,138245,1335,13860,22487,8651,16235,113592,4936,28008,81507,110237,100471,37774,3576,86402,136055,107142,27749,null,null,0,459,4040,1430,13194,1501,11064,12365432,"N/A",0,1197.97669333984,1544.2190134067457,2725,2650,2495,2540,2595,2535,2515,2450,2475,2490,2495,268,81,30,14,124,118,106,126,0,0,0,0,8775,9152,9579,10149,269,87,31,16,124,121,106,132,3294,3288,3357,3347,8796,9178,9575,10182,0,0,0,0,123,122,118,116,8249,8505,8755,8909,3294,3288,3357,3347,3687,3496,3494,3495,62070,115.4,513,520.1,30.7,126.4,298.4,180,333,7100,7064,7153,7154,7196,7244,7247,7346,7341,7437,7466,7578,7743,7796,7902,8060,8139,8236,8339,8423,8525,8692,8795,8881,8986,5231,5261,5198,5194,5126,5157,5149,5118,5080,5070,5049,5028,5015,4969,4890,4761,4634,4513,4398,4335,4340,4214,4154,4043,3987]
[123,8,{"$f":"IF('iaith - language'!$K$1=2,VLOOKUP(A15,Text!$A$3:$C$353,2,FALSE),VLOOKUP(A15,Text!$A$3:$C$353,3,FALSE))","v":"Powys"},309,345,321,328,"N/A",519531.00399999996,135059,1112,11611,18824,7109,13359,114718,4301,23306,72782,111753,84912,50147,5039,77936,133030,109186,36801,null,53365.62,0,3913,6820,2510,15563,1648,9083,11106773,"N/A",0,9102.60955724062,3010.7827405707812,2035,2040,2025,2030,2100,2100,2045,1990,1895,1885,1915,163,52,22,10,103,104,96,121,0,0,0,0,5962,6361,6721,7138,169,55,21,11,106,106,100,125,3304,3329,3411,3428,6011,6427,6796,7238,0,0,0,0,88,85,85,78,6109,6273,6412,6455,3304,3329,3411,3428,3579,3490,3532,3564,67070,242.6,2708.2000000000003,2129.1,34.4,114.3,220.6,426,399,4216,4199,4218,4259,4259,4302,4347,4390,4420,4500,4565,4618,4746,4825,4897,4960,5046,5099,5156,5221,5320,5464,5523,5592,5696,4353,4336,4312,4288,4257,4240,4220,4189,4183,4175,4175,4190,4158,4116,4062,4005,3929,3861,3785,3745,3722,3619,3552,3463,3396]
{"$rows_left_out":26}