{"text_format":"3","workbook":"xlsx","n_sheets":4,"sheets":["iaith - language","Text","queryformround1","2025-26 Settlement data"],"not_rendered":{"defined_names":12,"comments":1},"read":"whole","date_system":"1900"}

{"sheet":"iaith - language","index":0,"n_rows":6,"n_cols":12,"rows_kept":6}
[1,{"$nulls":9},1,"Cymraeg/Welsh"]
[{"$nulls":11},"Saesneg/English"]
[{"$nulls":11},"Dewiswch os gwelwch yn dda / Please select"]
[{"$f":"IF('iaith - language'!$K$1=3,\"\", IF('iaith - language'!$K$1=2,VLOOKUP(A1,Text!$A$2:$C$366,2,0),VLOOKUP(A1,Text!$A$2:$C$366,3,0)))","v":"Proses wirio data Cylch 1 - data i'w defnyddio ar gyfer Setliad 2025-26"}]
[]
["Dewiswch iaith / Choose your preferred language:"]

{"sheet":"Text","index":1,"n_rows":238,"n_cols":6,"rows_kept":238,"hidden":true,"merged":[[0,9,0,10]]}
[null,"English","Welsh"]
[1,"Round 1 Data verification process - data for use in the 2025-26 Settlement","Proses wirio data Cylch 1 - data i'w defnyddio ar gyfer Setliad 2025-26"]
[2,"Round 1 data verification process","Proses gwiriad data cylch 1"]
[3,"Please select your authority name:","Dewiswch enw eich awdurdod:"]
[4,"Pupils at Independent schools ","Disgyblion mewn ysgolion annibynnol"]
[5,"You are requested to notify us of any pupils educated in independent schools for pupils without statements of special educational need (excluding special schools) ","Gofynnir ichi roi gwybod inni am unrhyw ddisgyblion sy'n cael eu haddysgu mewn ysgolion annibynnol ar gyfer disgyblion nad ydynt ar ddatganiad anghenion addysgol arbennig (ac eithrio ysgolion arbennig)"]
[6,"for whom your authority pays full tuition fees as recorded on line 1.3.5 on the Section 52 outturn return. This information should be provided in respect of the position at April 2024.","y mae eich awdurdod yn talu ffïoedd dysgu llawn ar eu cyfer, fel sydd wedi'i gofnodi ar llinell 1.3.5 o adroddiad alldro Adran 52. Dylid darparu'r wybodaeth hon ar gyfer y sefyllfa fel yr oedd ym mis Ebrill 2024."]
[7,"These pupils are directly credited in the SSAs and it is therefore very important that this information is provided to ensure the accuracy of the calculations. ","Rhoddir credyd yn uniongyrchol ar gyfer y disgyblion hyn yn yr Asesiadau o Wariant Safonol, felly mae'n bwysig iawn fod yr wybodaeth hon yn cael ei darparu er mwyn sicrhau bod y cyfrifiadau'n gywir. "]
[8,"Please provide the figures to us in the table below. Note that it will be assumed that there are no such pupils unless otherwise indicated. ","Darparwch y ffigurau inni yn y tabl isod. Sylwch y cymerir yn ganiataol nad oes disgyblion o'r fath os na ddywedir yn wahanol. "]
[9,"Data set","Set ddata"]
{"$rows_left_out":229}
{"sheet":"queryformround1","index":2,"n_rows":138,"n_cols":11,"rows_kept":138,"merged":[[17,2,17,8],[18,2,18,8],[19,2,19,8],[24,2,25,2],[24,3,25,3],[24,4,25,4],[24,5,25,5],[24,6,25,6],[47,8,49,8],[103,3,104,3],[128,8,133,8]]}
[2,null,{"$f":"IF('iaith - language'!K1=2,VLOOKUP(A1,Text!A3:C316,2),VLOOKUP(A1,Text!A3:C318,3))","v":"Proses gwiriad data cylch 1"}]
[]
[3,null,{"$f":"IF('iaith - language'!K1=2,VLOOKUP(A3,Text!A3:C316,2),VLOOKUP(A3,Text!A3:C318,3))","v":"Dewiswch enw eich awdurdod:"}]
[]
[4,null,{"$f":"IF('iaith - language'!$K$1=2,VLOOKUP(A5,Text!$A$3:$C$402,2,0),VLOOKUP(A5,Text!$A$3:$C$402,3,0))","v":"Disgyblion mewn ysgolion annibynnol"}]
[5,null,{"$f":"IF('iaith - language'!$K$1=2,VLOOKUP(A6,Text!$A$3:$C$402,2,0),VLOOKUP(A6,Text!$A$3:$C$402,3,0))","v":"Gofynnir ichi roi gwybod inni am unrhyw ddisgyblion sy'n cael eu haddysgu mewn ysgolion annibynnol ar gyfer disgyblion nad ydynt ar ddatganiad anghenion addysgol arbennig (ac eithrio ysgolion arbennig)"}]
[6,null,{"$f":"IF('iaith - language'!$K$1=2,VLOOKUP(A7,Text!$A$3:$C$402,2,0),VLOOKUP(A7,Text!$A$3:$C$402,3,0))","v":"y mae eich awdurdod yn talu ffïoedd dysgu llawn ar eu cyfer, fel sydd wedi'i gofnodi ar llinell 1.3.5 o adroddiad alldro Adran 52. Dylid darparu'r wybodaeth hon ar gyfer y sefyllfa fel yr oedd ym mis Ebrill 2024."}]
[7,null,{"$f":"IF('iaith - language'!$K$1=2,VLOOKUP(A8,Text!$A$3:$C$402,2,0),VLOOKUP(A8,Text!$A$3:$C$402,3,0))","v":"Rhoddir credyd yn uniongyrchol ar gyfer y disgyblion hyn yn yr Asesiadau o Wariant Safonol, felly mae'n bwysig iawn fod yr wybodaeth hon yn cael ei darparu er mwyn sicrhau bod y cyfrifiadau'n gywir. "}]
[8,null,{"$f":"IF('iaith - language'!$K$1=2,VLOOKUP(A9,Text!$A$3:$C$402,2,0),VLOOKUP(A9,Text!$A$3:$C$402,3,0))","v":"Darparwch y ffigurau inni yn y tabl isod. Sylwch y cymerir yn ganiataol nad oes disgyblion o'r fath os na ddywedir yn wahanol. "}]
[9]
{"$rows_left_out":129}
{"sheet":"2025-26 Settlement data","index":3,"n_rows":41,"n_cols":111,"rows_kept":41,"merged":[[5,3,5,6],[5,41,5,51],[5,52,5,55],[5,56,5,59],[5,60,5,63],[5,64,5,67],[5,68,5,71],[5,72,5,75],[5,76,5,79],[5,80,5,83],[5,84,5,87],[5,88,5,91],[5,92,5,95],[5,96,5,99],[5,100,5,103]]}
[null,600,{"$f":"IF('iaith - language'!$K$1=2,VLOOKUP(B1,Text!$A$1:$C$353,2,FALSE),VLOOKUP(B1,Text!$A$1:$C$353,3,FALSE))","v":"Proses wirio data Cylch 1 - data i'w defnyddio ar gyfer Setliad 2025-26"}]
[]
[{"$nulls":3},51,{"$nulls":3},61,62,67,68,69,70,71,72,73,74,75,76,77,78,79,80,81,82,83,84,86,90,91,92,145,147,143,149,151,152,152.5,160,162,163,192,{"$nulls":10},194,{"$nulls":3},195,{"$nulls":3},196,{"$nulls":3},197,{"$nulls":3},198,{"$nulls":3},199,{"$nulls":3},200,{"$nulls":3},201,{"$nulls":3},202,{"$nulls":3},203,{"$nulls":3},204,{"$nulls":3},205,{"$nulls":3},206,{"$nulls":3},271.5,53,55,57,54,56,58]
[{"$nulls":3},601,{"$f":"D4+1","v":602},{"$f":"E4+1","v":603},{"$f":"F4+1","v":604},{"$f":"G4+1","v":605},605,{"$nulls":20},605,null,604,604,606,{"$nulls":7},607,{"$f":"AP4+1","v":608},{"$f":"AQ4+1","v":609},{"$f":"AR4+1","v":610},{"$f":"AS4+1","v":611},604,606,605,612,{"$f":"AX4+1","v":613},{"$f":"AY4+1","v":614},615,616,608,611,{"$f":"BA4","v":615},616,608,611,615,616,608,611,615,616,608,611,615,616,608,611,615,616,608,611,615,616,608,611,615,616,608,611,615,616,608,611,615,616,608,611,615,616,608,611,615,616,608,611,615,616,608,611,{"$f":"G4","v":604},604,604,604,604,604,604]
[]
[{"$nulls":3},{"$f":"IF('iaith - language'!$K$1=2,VLOOKUP(D3,Text!$A$3:$C$353,2,FALSE),VLOOKUP(D3,Text!$A$3:$C$353,3,FALSE))","v":"Ceisiadau Cynllunio a Gafwyd"},{"$nulls":3},{"$f":"IF('iaith - language'!$K$1=2,VLOOKUP(H3,Text!$A$3:$C$353,2,FALSE),VLOOKUP(H3,Text!$A$3:$C$353,3,FALSE))","v":"Stoc anheddau'r sector preifat"},{"$f":"IF('iaith - language'!$K$1=2,VLOOKUP(I3,Text!$A$3:$C$353,2,FALSE),VLOOKUP(I3,Text!$A$3:$C$353,3,FALSE))","v":"Arwynebedd tir (hectarau)"},{"$f":"IF('iaith - language'!$K$1=2,VLOOKUP(J3,Text!$A$3:$C$353,2,FALSE),VLOOKUP(J3,Text!$A$3:$C$353,3,FALSE))","v":"Cyfanswm y boblogaeth"},{"$f":"IF('iaith - language'!$K$1=2,VLOOKUP(K3,Text!$A$3:$C$353,2,FALSE),VLOOKUP(K3,Text!$A$3:$C$353,3,FALSE))","v":"Poblogaeth 3 oed "},{"$f":"IF('iaith - language'!$K$1=2,VLOOKUP(L3,Text!$A$3:$C$353,2,FALSE),VLOOKUP(L3,Text!$A$3:$C$353,3,FALSE))","v":"Poblogaeth 3 i 11 oed"},{"$f":"IF('iaith - language'!$K$1=2,VLOOKUP(M3,Text!$A$3:$C$353,2,FALSE),VLOOKUP(M3,Text!$A$3:$C$353,3,FALSE))","v":"Poblogaeth 3 i 16 oed "},{"$f":"IF('iaith - language'!$K$1=2,VLOOKUP(N3,Text!$A$3:$C$353,2,FALSE),VLOOKUP(N3,Text!$A$3:$C$353,3,FALSE))","v":"Poblogaeth 11 i 15 oed "},{"$f":"IF('iaith - language'!$K$1=2,VLOOKUP(O3,Text!$A$3:$C$353,2,FALSE),VLOOKUP(O3,Text!$A$3:$C$353,3,FALSE))","v":"Poblogaeth 11 i 20 oed "},{"$f":"IF('iaith - language'!$K$1=2,VLOOKUP(P3,Text!$A$3:$C$353,2,FALSE),VLOOKUP(P3,Text!$A$3:$C$353,3,FALSE))","v":"Poblogaeth 16 oed a throsodd "},{"$f":"IF('iaith - language'!$K$1=2,VLOOKUP(Q3,Text!$A$3:$C$353,2,FALSE),VLOOKUP(Q3,Text!$A$3:$C$353,3,FALSE))","v":"Poblogaeth 16 i 18 oed "},{"$f":"IF('iaith - language'!$K$1=2,VLOOKUP(R3,Text!$A$3:$C$353,2,FALSE),VLOOKUP(R3,Text!$A$3:$C$353,3,FALSE))","v":"Poblogaeth 0 i 17 oed "},{"$f":"IF('iaith - language'!$K$1=2,VLOOKUP(S3,Text!$A$3:$C$353,2,FALSE),VLOOKUP(S3,Text!$A$3:$C$353,3,FALSE))","v":"Poblogaeth 18 i 64 oed "},{"$f":"IF('iaith - language'!$K$1=2,VLOOKUP(T3,Text!$A$3:$C$353,2,FALSE),VLOOKUP(T3,Text!$A$3:$C$353,3,FALSE))","v":"Poblogaeth 18 oed a throsodd "},{"$f":"IF('iaith - language'!$K$1=2,VLOOKUP(U3,Text!$A$3:$C$353,2,FALSE),VLOOKUP(U3,Text!$A$3:$C$353,3,FALSE))","v":"Poblogaeth o dan 60 oed "},{"$f":"IF('iaith - language'!$K$1=2,VLOOKUP(V3,Text!$A$3:$C$353,2,FALSE),VLOOKUP(V3,Text!$A$3:$C$353,3,FALSE))","v":"Poblogaeth 60 oed a throsodd"},{"$f":"IF('iaith - language'!$K$1=2,VLOOKUP(W3,Text!$A$3:$C$353,2,FALSE),VLOOKUP(W3,Text!$A$3:$C$353,3,FALSE))","v":"Poblogaeth 85 oed a throsodd "},{"$f":"IF('iaith - language'!$K$1=2,VLOOKUP(X3,Text!$A$3:$C$353,2,FALSE),VLOOKUP(X3,Text!$A$3:$C$353,3,FALSE))","v":"Poblogaeth oedran gweithio (16-65G/B) "},{"$f":"IF('iaith - language'!$K$1=2,VLOOKUP(Y3,Text!$A$3:$C$353,2,FALSE),VLOOKUP(Y3,Text!$A$3:$C$353,3,FALSE))","v":"Amcangyfrifon Poblogaeth Ganol Blwyddyn, pob oed"},{"$f":"IF('iaith - language'!$K$1=2,VLOOKUP(Z3,Text!$A$3:$C$353,2,FALSE),VLOOKUP(Z3,Text!$A$3:$C$353,3,FALSE))","v":"Amcangyfrifon Poblogaeth Ganol Blwyddyn, 18 oed a throsodd"},{"$f":"IF('iaith - language'!$K$1=2,VLOOKUP(AA3,Text!$A$3:$C$353,2,FALSE),VLOOKUP(AA3,Text!$A$3:$C$353,3,FALSE))","v":"Amcangyfrifon Poblogaeth Ganol Blwyddyn, 65 oed a throsodd"},{"$f":"IF('iaith - language'!$K$1=2,VLOOKUP(AB3,Text!$A$3:$C$353,2,FALSE),VLOOKUP(AB3,Text!$A$3:$C$353,3,FALSE))","v":"Swm a wariwyd ar grantiau cyfleusterau i'r anabl wedi'u cwblhau (£s)"},{"$f":"IF('iaith - language'!$K$1=2,VLOOKUP(AC3,Text!$A$3:$C$353,2,FALSE),VLOOKUP(AC3,Text!$A$3:$C$353,3,FALSE))","v":"Praeseptau Draenio Tir"},{"$f":"IF('iaith - language'!$K$1=2,VLOOKUP(AD3,Text!$A$3:$C$353,2,FALSE),VLOOKUP(AD3,Text!$A$3:$C$353,3,FALSE))","v":"Hyd yr arfordir a warchodir"},{"$f":"IF('iaith - language'!$K$1=2,VLOOKUP(AE3,Text!$A$3:$C$353,2,FALSE),VLOOKUP(AE3,Text!$A$3:$C$353,3,FALSE))","v":"Nifer y Ffermydd"},{"$f":"IF('iaith - language'!$K$1=2,VLOOKUP(AF3,Text!$A$3:$C$353,2,FALSE),VLOOKUP(AF3,Text!$A$3:$C$353,3,FALSE))","v":"Nifer yr Eiddo Masnachu"},{"$f":"IF('iaith - language'!$K$1=2,VLOOKUP(AG3,Text!$A$3:$C$353,2,FALSE),VLOOKUP(AG3,Text!$A$3:$C$353,3,FALSE))","v":"Nifer yr Eiddo Bwyd"},{"$f":"IF('iaith - language'!$K$1=2,VLOOKUP(AH3,Text!$A$3:$C$353,2,FALSE),VLOOKUP(AH3,Text!$A$3:$C$353,3,FALSE))","v":"Cyfanswm yr unedau goleuadau stryd"},{"$f":"IF('iaith - language'!$K$1=2,VLOOKUP(AI3,Text!$A$3:$C$353,2,FALSE),VLOOKUP(AI3,Text!$A$3:$C$353,3,FALSE))","v":"Nifer y marwolaethau wedi'u cofrestru"},{"$f":"IF('iaith - language'!$K$1=2,VLOOKUP(AJ3,Text!$A$3:$C$353,2,FALSE),VLOOKUP(AJ3,Text!$A$3:$C$353,3,FALSE))","v":"Llwyth achosion Cynlluniau Gostyngiadau'r Dreth Gyngor "},{"$f":"IF('iaith - language'!$K$1=2,VLOOKUP(AK3,Text!$A$3:$C$353,2,FALSE),VLOOKUP(AK3,Text!$A$3:$C$353,3,FALSE))","v":"Gwariant Cynlluniau Gostyngiadau'r Dreth Gyngor"},{"$f":"IF('iaith - language'!$K$1=2,VLOOKUP(AL3,Text!$A$3:$C$353,2,FALSE),VLOOKUP(AL3,Text!$A$3:$C$353,3,FALSE))","v":"Cefnogaeth CTRS Covid-19 "},{"$f":"IF('iaith - language'!$K$1=2,VLOOKUP(AM3,Text!$A$3:$C$353,2,FALSE),VLOOKUP(AM3,Text!$A$3:$C$353,3,FALSE))","v":"Nifer y llongau sy'n cyrraedd porthladdoedd"},{"$f":"IF('iaith - language'!$K$1=2,VLOOKUP(AN3,Text!$A$3:$C$353,2,FALSE),VLOOKUP(AN3,Text!$A$3:$C$353,3,FALSE))","v":"Nosweithiau twristiaid (miloedd) gan gynnwys AirBnb"},{"$f":"IF('iaith - language'!$K$1=2,VLOOKUP(AO3,Text!$A$3:$C$353,2,FALSE),VLOOKUP(AO3,Text!$A$3:$C$353,3,FALSE))","v":"Diwrnodau twristiaid (miloedd)"},{"$f":"IF('iaith - language'!$K$1=2,VLOOKUP(AP3,Text!$A$3:$C$353,2,FALSE),VLOOKUP(AP3,Text!$A$3:$C$353,3,FALSE))","v":"Data Hawlwyr Budd-dal "},{"$nulls":10},{"$f":"IF('iaith - language'!$K$1=2,VLOOKUP(BA3,Text!$A$3:$C$353,2,FALSE),VLOOKUP(BA3,Text!$A$3:$C$353,3,FALSE))","v":"Nifer yr Hawlwyr Cymhorthdal Incwm, 18-64 oed"},{"$nulls":3},{"$f":"IF('iaith - language'!$K$1=2,VLOOKUP(BE3,Text!$A$3:$C$353,2,FALSE),VLOOKUP(BE3,Text!$A$3:$C$353,3,FALSE))","v":"Nifer y Derbynwyr Lwfans Ceisio Swydd ar Sail Incwm, 18-64 oed"},{"$nulls":3},{"$f":"IF('iaith - language'!$K$1=2,VLOOKUP(BI3,Text!$A$3:$C$353,2,FALSE),VLOOKUP(BI3,Text!$A$3:$C$353,3,FALSE))","v":"Nifer yr hawlwyr Credyd Pensiwn, 18-64 oed"},{"$nulls":3},{"$f":"IF('iaith - language'!$K$1=2,VLOOKUP(BM3,Text!$A$3:$C$353,2,FALSE),VLOOKUP(BM3,Text!$A$3:$C$353,3,FALSE))","v":"Nifer y rhai sydd yn derbyn Credyd Cynhwysol (ddim mewn cyflogaeth) 18-64 oed"},{"$nulls":3},{"$f":"IF('iaith - language'!$K$1=2,VLOOKUP(BQ3,Text!$A$3:$C$353,2,FALSE),VLOOKUP(BQ3,Text!$A$3:$C$353,3,FALSE))","v":"Cyfanswm yr Hawlwyr Cymhorthdal Incwm"},{"$nulls":3},{"$f":"IF('iaith - language'!$K$1=2,VLOOKUP(BU3,Text!$A$3:$C$353,2,FALSE),VLOOKUP(BU3,Text!$A$3:$C$353,3,FALSE))","v":"Cyfanswm y Derbynwyr Lwfans Ceisio Swydd ar Sail Incwm"},{"$nulls":3},{"$f":"IF('iaith - language'!$K$1=2,VLOOKUP(BY3,Text!$A$3:$C$353,2,FALSE),VLOOKUP(BY3,Text!$A$3:$C$353,3,FALSE))","v":"Cyfanswm Hawlwyr Credyd Pensiwn"},{"$nulls":3},{"$f":"IF('iaith - language'!$K$1=2,VLOOKUP(CC3,Text!$A$3:$C$353,2,FALSE),VLOOKUP(CC3,Text!$A$3:$C$353,3,FALSE))","v":"Cyfanswm y rhai sy’n derbyn Credyd Cynhwysol (ddim mewn cyflogaeth)"},{"$nulls":3},{"$f":"IF('iaith - language'!$K$1=2,VLOOKUP(CG3,Text!$A$3:$C$353,2,FALSE),VLOOKUP(CG3,Text!$A$3:$C$353,3,FALSE))","v":"Nifer yr Hawlwyr Lwfans Anabledd Difrifol, 18-64 oed"},{"$nulls":3},{"$f":"IF('iaith - language'!$K$1=2,VLOOKUP(CK3,Text!$A$3:$C$353,2,FALSE),VLOOKUP(CK3,Text!$A$3:$C$353,3,FALSE))","v":"Nifer yr Hawlwyr Lwfans Byw i'r Anabl, 18-64 oed"},{"$nulls":3},{"$f":"IF('iaith - language'!$K$1=2,VLOOKUP(CO3,Text!$A$3:$C$353,2,FALSE),VLOOKUP(CO3,Text!$A$3:$C$353,3,FALSE))","v":"Nifer yr Hawlwyr Taliad Annibyniaeth Bersonol sydd yn 18-64 oed"},{"$nulls":3},{"$f":"IF('iaith - language'!$K$1=2,VLOOKUP(CS3,Text!$A$3:$C$353,2,FALSE),VLOOKUP(CS3,Text!$A$3:$C$353,3,FALSE))","v":"Hawlwyr Credyd Pensiwn, 65 oed a hŷn "},{"$nulls":3},{"$f":"IF('iaith - language'!$K$1=2,VLOOKUP(CW3,Text!$A$3:$C$353,2,FALSE),VLOOKUP(CW3,Text!$A$3:$C$353,3,FALSE))","v":"Cyfanswn yr hawlwyr Cymhorthdal Incwm, Lwfans Ceisio Gwaith, a Chredyd Pensiwn"},{"$nulls":3},{"$f":"IF('iaith - language'!$K$1=2,VLOOKUP(DA3,Text!$A$3:$C$353,2,FALSE),VLOOKUP(DA3,Text!$A$3:$C$353,3,FALSE))","v":"Stoc eiddo treth cyngor"},{"$f":"IF('iaith - language'!$K$1=2,VLOOKUP(DB3,Text!$A$3:$C$353,2,FALSE),VLOOKUP(DB3,Text!$A$3:$C$353,3,FALSE))","v":"Hyd ffyrdd A y sir (km)"},{"$f":"IF('iaith - language'!$K$1=2,VLOOKUP(DC3,Text!$A$3:$C$353,2,FALSE),VLOOKUP(DC3,Text!$A$3:$C$353,3,FALSE))","v":"Hyd ffyrdd B ac C (km)"},{"$f":"IF('iaith - language'!$K$1=2,VLOOKUP(DD3,Text!$A$3:$C$353,2,FALSE),VLOOKUP(DD3,Text!$A$3:$C$353,3,FALSE))","v":"Hyd is-ffyrdd â wyneb caled (km)"},{"$f":"IF('iaith - language'!$K$1=2,VLOOKUP(DE3,Text!$A$3:$C$353,2,FALSE),VLOOKUP(DE3,Text!$A$3:$C$353,3,FALSE))","v":"Hyd ffyrdd A y sir, adeiledig (km)"},{"$f":"IF('iaith - language'!$K$1=2,VLOOKUP(DF3,Text!$A$3:$C$353,2,FALSE),VLOOKUP(DF3,Text!$A$3:$C$353,3,FALSE))","v":"Hyd ffyrdd B ac C, adeiledig (km)"},{"$f":"IF('iaith - language'!$K$1=2,VLOOKUP(DG3,Text!$A$3:$C$353,2,FALSE),VLOOKUP(DG3,Text!$A$3:$C$353,3,FALSE))","v":"Hyd is-ffyrdd â wyneb caled, adeiledig (km)"}]
[null,0,null,"2023-06-01","2023-09-01","2023-12-01","2024-03-01","2023-03-01","2024-05-01","2023","2023",{"$f":"K7","v":"2023"},{"$f":"L7","v":"2023"},"2023","2023","2023","2023","2023","2023","2023","2023","2023","2023","2023","2020","2020","2020","2018-19","2024-25",{"$f":"IF('iaith - language'!$K$1=2,VLOOKUP(AD$4,Text!$A$1:$C$458,2,FALSE),VLOOKUP(AD$4,Text!$A$1:$C$458,3,FALSE))","v":"Mai 2022"},"2021","2024-03-01","2024-03-01","2024-04-01","2023","2023-24","2023-24","2021-22","2023","2019","2019","2023-10-01","2023-11-01","2023-12-01","2024-01-01","2024-02-01","2024-03-01","2024-04-01","2024-05-01","2024-06-01","2024-07-01","2024-08-01","2023-05-01","2023-08-01","2023-11-01","2024-02-01","2023-05-01","2023-08-01","2023-11-01","2024-02-01","2023-05-01","2023-08-01","2023-11-01","2024-02-01","2023-05-01","2023-08-01","2023-11-01","2024-02-01","2023-05-01","2023-08-01","2023-11-01","2024-02-01","2023-05-01","2023-08-01","2023-11-01","2024-02-01","2023-05-01","2023-08-01","2023-11-01","2024-02-01","2023-05-01","2023-08-01","2023-11-01","2024-02-01","2023-05-01","2023-08-01","2023-11-01","2024-02-01","2023-05-01","2023-08-01","2023-11-01","2024-02-01","2023-05-01","2023-08-01","2023-11-01","2024-02-01","2023-05-01","2023-08-01","2023-11-01","2024-02-01","2023-05-01","2023-08-01","2023-11-01","2024-02-01","2024-03-01","2024-04-01","2024-04-01","2024-04-01","2024-04-01","2024-04-01","2024-04-01"]
[]
[117,2,{"$f":"IF('iaith - language'!$K$1=2,VLOOKUP(A9,Text!$A$3:$C$353,2,FALSE),VLOOKUP(A9,Text!$A$3:$C$353,3,FALSE))","v":"Sir Ynys Môn"},194,220,218,171,"N/A",{"v":71519.94099999999,"d":"71,520"},{"v":69841.501005,"d":"69,842"},{"v":707.707666,"d":"708"},{"v":6725.620739000001,"d":"6,726"},{"v":10721.435633000001,"d":"10,721"},{"v":4052.2980740000003,"d":"4,052"},{"v":7202.189885000001,"d":"7,202"},{"v":57855.612657000005,"d":"57,856"},{"v":2155.155319,"d":"2,155"},{"v":13490.483983999999,"d":"13,490"},{"v":37430.681448999996,"d":"37,431"},{"v":56351.017024000015,"d":"56,351"},{"v":45486.79176499999,"d":"45,487"},{"v":24354.709242999998,"d":"24,355"},{"v":2365.558295,"d":"2,366"},{"v":39959.59234599999,"d":"39,960"},{"v":70440,"d":"70,440"},{"v":57101,"d":"57,101"},{"v":18639,"d":"18,639"},null,{"v":4280.9,"d":"4,281"},7.9,935,{"v":3510,"d":"3,510"},{"v":1020,"d":"1,020"},{"v":9963,"d":"9,963"},920,{"v":5554,"d":"5,554"},{"v":6029938,"d":"6,029,938"},"N/A",{"v":3117,"d":"3,117"},{"v":5514.022396125236,"d":"5,514"},{"v":707.4918435630126,"d":"707"},{"v":1345,"d":"1,345"},{"v":1410,"d":"1,410"},{"v":1405,"d":"1,405"},{"v":1425,"d":"1,425"},{"v":1450,"d":"1,450"},{"v":1420,"d":"1,420"},{"v":1375,"d":"1,375"},{"v":1340,"d":"1,340"},{"v":1390,"d":"1,390"},{"v":1465,"d":"1,465"},{"v":1480,"d":"1,480"},166,157,150,145,201,141,121,108,0,0,0,0,{"v":3392,"d":"3,392"},{"v":3511,"d":"3,511"},{"v":3659,"d":"3,659"},{"v":3839,"d":"3,839"},167,159,157,150,209,151,123,113,{"v":2086,"d":"2,086"},{"v":2075,"d":"2,075"},{"v":2048,"d":"2,048"},{"v":2034,"d":"2,034"},{"v":3524,"d":"3,524"},{"v":3637,"d":"3,637"},{"v":3806,"d":"3,806"},{"v":4000,"d":"4,000"},0,0,0,0,73,73,73,68,{"v":3298,"d":"3,298"},{"v":3401,"d":"3,401"},{"v":3512,"d":"3,512"},{"v":3560,"d":"3,560"},{"v":2086,"d":"2,086"},{"v":2075,"d":"2,075"},{"v":2048,"d":"2,048"},{"v":2034,"d":"2,034"},{"v":2462,"d":"2,462"},{"v":2385,"d":"2,385"},{"v":2328,"d":"2,328"},{"v":2297,"d":"2,297"},{"v":35810,"d":"35,810"},{"v":145.6,"d":"145.60"},{"v":484.5,"d":"484.50"},{"v":559.1,"d":"559.10"},{"v":28.1,"d":"28.10"},{"v":59.599999999999994,"d":"59.60"},{"v":181.5,"d":"181.50"}]
[118,3,{"$f":"IF('iaith - language'!$K$1=2,VLOOKUP(A10,Text!$A$3:$C$353,2,FALSE),VLOOKUP(A10,Text!$A$3:$C$353,3,FALSE))","v":"Gwynedd"},201,204,212,205,"N/A",{"v":254857.43099999998,"d":"254,857"},{"v":125539.055315,"d":"125,539"},{"v":1223.025991,"d":"1,223"},{"v":11518.327215,"d":"11,518"},{"v":18638.486754999998,"d":"18,638"},{"v":7147.769282000001,"d":"7,148"},{"v":15965.208525000002,"d":"15,965"},{"v":104686.328307,"d":"104,686"},{"v":4360.460358,"d":"4,360"},{"v":23748.736455000002,"d":"23,749"},{"v":72697.07376699998,"d":"72,697"},{"v":101790.31886499995,"d":"101,790"},{"v":87997.796688,"d":"87,998"},{"v":37541.25863200001,"d":"37,541"},{"v":4066.4066869999997,"d":"4,066"},{"v":77235.49058799999,"d":"77,235"},{"v":125171,"d":"125,171"},{"v":101957,"d":"101,957"},{"v":28562,"d":"28,562"},null,{"v":124710.76000000001,"d":"124,711"},{"v":20.14,"d":"20.1"},{"v":1822,"d":"1,822"},{"v":8480,"d":"8,480"},{"v":2500,"d":"2,500"},{"v":18072,"d":"18,072"},{"v":1441,"d":"1,441"},{"v":8105,"d":"8,105"},{"v":9552887,"d":"9,552,887"},"N/A",0,{"v":20095.71004285075,"d":"20,096"},{"v":3836.383671608743,"d":"3,836"},{"v":1820,"d":"1,820"},{"v":1910,"d":"1,910"},{"v":1950,"d":"1,950"},{"v":1995,"d":"1,995"},{"v":2020,"d":"2,020"},{"v":1990,"d":"1,990"},{"v":1905,"d":"1,905"},{"v":1850,"d":"1,850"},{"v":1950,"d":"1,950"},{"v":2120,"d":"2,120"},{"v":2125,"d":"2,125"},227,217,207,202,135,114,125,119,0,0,0,0,{"v":5121,"d":"5,121"},{"v":5137,"d":"5,137"},{"v":5264,"d":"5,264"},{"v":5618,"d":"5,618"},235,219,215,205,142,117,127,122,{"v":3433,"d":"3,433"},{"v":3393,"d":"3,393"},{"v":3367,"d":"3,367"},{"v":3343,"d":"3,343"},{"v":5286,"d":"5,286"},{"v":5309,"d":"5,309"},{"v":5454,"d":"5,454"},{"v":5809,"d":"5,809"},0,0,0,0,93,91,90,87,{"v":4776,"d":"4,776"},{"v":4952,"d":"4,952"},{"v":5070,"d":"5,070"},{"v":5222,"d":"5,222"},{"v":3433,"d":"3,433"},{"v":3393,"d":"3,393"},{"v":3367,"d":"3,367"},{"v":3343,"d":"3,343"},{"v":3810,"d":"3,810"},{"v":3729,"d":"3,729"},{"v":3709,"d":"3,709"},{"v":3670,"d":"3,670"},{"v":61800,"d":"61,800"},{"v":341.6,"d":"341.60"},{"v":1064.9,"d":"1,064.90"},{"v":1323.3,"d":"1,323.30"},{"v":74.6,"d":"74.60"},{"v":104.30000000000001,"d":"104.30"},{"v":346.9,"d":"346.90"}]
{"$rows_left_out":31}