{"text_format":"3","workbook":"xlsx","n_sheets":7,"sheets":["iaith - language","Text","queryformround1","2023-24 Settlement data ","2022-23 Settlement data","2021-22 Settlement data","2020-21 Settlement data"],"not_rendered":{"external_links":1,"defined_names":17,"comments":4},"read":"whole","date_system":"1900"}

{"sheet":"iaith - language","index":0,"n_rows":6,"n_cols":12,"rows_kept":6}
[1,{"$nulls":9},1,"Cymraeg/Welsh"]
[{"$nulls":11},"Saesneg/English"]
[{"$nulls":11},"Dewiswch os gwelwch yn dda / Please select"]
[{"$f":"IF('iaith - language'!$K$1=3,\"\", IF('iaith - language'!$K$1=2,VLOOKUP(A1,Text!$A$2:$C$366,2,0),VLOOKUP(A1,Text!$A$2:$C$366,3,0)))","v":"Proses wirio data Cylch 1 - data i'w defnyddio ar gyfer Setliad 2023-24"}]
[]
["Dewiswch iaith / Choose your preferred language:"]

{"sheet":"Text","index":1,"n_rows":238,"n_cols":6,"rows_kept":238,"hidden":true,"merged":[[0,9,0,10]]}
[null,"English","Welsh"]
[1,"Round 1 Data verification process - data for use in the 2023-24 Settlement","Proses wirio data Cylch 1 - data i'w defnyddio ar gyfer Setliad 2023-24"]
[2,"Round 1 data verification process","Proses gwiriad data cylch 1"]
[3,"Please select your authority name:","Dewiswch enw eich awdurdod:"]
[4,"Pupils at Independent schools ","Disgyblion mewn ysgolion annibynnol"]
[5,"You are requested to notify us of any pupils educated in independent schools for pupils without statements of special educational need (excluding special schools) ","Gofynnir ichi roi gwybod inni am unrhyw ddisgyblion sy'n cael eu haddysgu mewn ysgolion annibynnol ar gyfer disgyblion nad ydynt ar ddatganiad anghenion addysgol arbennig (ac eithrio ysgolion arbennig)"]
[6,"for whom your authority pays full tuition fees as recorded on line 1.3.5 on the Section 52 outturn return. This information should be provided in respect of the position at April 2022.","y mae eich awdurdod yn talu ffïoedd dysgu llawn ar eu cyfer, fel sydd wedi'i gofnodi ar llinell 1.3.5 o adroddiad alldro Adran 52. Dylid darparu'r wybodaeth hon ar gyfer y sefyllfa fel yr oedd ym mis Ebrill 2022."]
[7,"These pupils are directly credited in the SSAs and it is therefore very important that this information is provided to ensure the accuracy of the calculations. ","Rhoddir credyd yn uniongyrchol ar gyfer y disgyblion hyn yn yr Asesiadau o Wariant Safonol, felly mae'n bwysig iawn fod yr wybodaeth hon yn cael ei darparu er mwyn sicrhau bod y cyfrifiadau'n gywir. "]
[8,"Please provide the figures to us in the table below. Note that it will be assumed that there are no such pupils unless otherwise indicated. ","Darparwch y ffigurau inni yn y tabl isod. Sylwch y cymerir yn ganiataol nad oes disgyblion o'r fath os na ddywedir yn wahanol. "]
[9,"Data set","Set ddata"]
[10,"Pupils in N2 or reception year groups in nursery or primary schools","Disgyblion mewn grwpiau blwyddyn meithrin 2 neu flwyddyn derbyn mewn ysgolion meithrin neu gynradd"]
[11,"Primary school pupils in year groups 1 and above","Disgyblion ysgol gynradd yng ngrwpiau blwyddyn 1 ac uwch"]
[12,"Secondary school pupils in year groups 10 and 11","Disgyblion ysgol uwchradd yng ngrwpiau blwyddyn 10 ac 11"]
[13,"Secondary school pupils in year groups 7-11","Disgyblion ysgol uwchradd yng ngrwpiau blwyddyn 7-11"]
[14,"Secondary school pupils in year groups 12-14","Disgyblion ysgol uwchradd yng ngrwpiau blwyddyn 12-14"]
[15,"The non-financial data originally sourced by Local Authorities is used to calculate Standard Spending Assessments within the Local Government Settlement. ","Defnyddir y data heb fod yn ariannol, a gasglwyd yn wreiddiol gan Awdurdodau Lleol, i gyfrifo Asesiadau o Wariant Safonol (SSAs) yn y Setliad Llywodraeth Leol. "]
[16,"This data has already been through various quality assurance and validation processes prior to its publication.","Mae'r data hyn eisoes wedi bod drwy amryw o brosesau sicrhau ansawdd a gwirio cyn iddynt gael eu cyhoeddi."]
[17,"The purpose of the data verification exercise is not to re-visit published estimates where the changes are minor. This process is to ensure that any significant errors or revisions to the non-financial data are identified prior to the publication of the Local Government Settlement.","Ni ddylid defnyddio’r broses wirio hon i roi sylw i amcangyfrifon sydd wedi eu cyhoeddi os yw’r newidiadau dan sylw yn rhai mân. Yn hytrach, nod y broses yw sicrhau bod unrhyw gamgymeriadau sylweddol yn y data heb fod yn ariannol, neu newidiadau o bwys iddynt, yn cael eu nodi cyn cyhoeddi'r Setliad Llywodraeth Leol. "]
[18,"Query form for comments on data","Ffurflen ymholiadau ar gyfer sylwadau ar y data"]
[19,"Topic area","Pwnc"]
[20,"Data point","Pwynt data"]
[21,"Verification figure","Ffigur gwiriad"]
[22,"Data Repository","Ystorfa Ddata"]
[23,"Updated Figure","Ffigur diwygiedig"]
[24,"Only if agreed by data repository","Dim ond os cytunwyd gan yr ystorfa ddata"]
[25,"Comments/Queries","Sylwadau/Ymholiadau"]
[26,"If you have agreed an update to your published data with the relevant data repository, please provide details here","Os ydych chi wedi cael cytundeb yr ystorfa ddata berthnasol i ddiwygio eich data cyhoeddedig, rhowch fanylion "]
[27," Local Government Finance Policy and Sustainability Division, Welsh Government","Yr Is-adran Polisi Cyllid Llywodraeth Leol a Chynaliadwyedd, Llywodraeth Cymru"]
[28,"Please return by email to:","I'w ddychwelyd drwy e-bost i:"]
[29,"Welsh Government ","Llywodraeth Cymru"]
[30,"For queries please contact: ","Os oes gennych ymholiadau, cysylltwch â:"]
[31,"For detailed descriptions on the data in this spreadsheet please see the data note document for round 1 verification on the website:","Mae disgrifiadau manwl o'r data yn y daenlen hon i'w cael yn y ddogfen nodiadau ar y data ar gyfer gwiriad cylch 1, sydd ar gael ar y wefan. "]
[32,"https://gov.wales/topics/localgovernment/finandfunding/settlement/local-gov-verification-settlement-2022-23/?lang=en","https://llyw.cymru/topics/localgovernment/finandfunding/settlement/local-gov-verification-settlement-2022-23/?skip=1&lang=cy"]
[33,"Notes:","Nodiadau:"]
[34,"1 This data set is taken as a 3 year average in the settlement.","1 Caiff y set ddata hon ei chymryd fel cyfartaledd 3 blynedd yn y setliad."]
[35,"2 The dataset 'Private Sector Dwelling Stock' was removed from the Revenue Support Grant settlement calculations, although is included within the General Capital Funding (GCF) formulae","2 Cafodd y set ddata 'Stoc Anheddau'r Sector Preifat' ei hepgor o'r cyfrifiadau ar gyfer y setliad Grant Cynnal Refeniw, ond mae wedi ei chynnwys yn y fformiwlâu ar gyfer Cyllid Cyfalaf Cyffredinol"]
[36,"3 This data was not used in 2012-13","3 Ni ddefnyddiwyd y data hyn yn 2012-13"]
[null,"Data - English","Data - Welsh"]
[38,"PLANNING APPLICATIONS","CEISIADAU CYNLLUNIO"]
[39,"TAX CREDIT CLAIMANTS","HAWLWYR CREDYD TRETH"]
[40,"ROADS DATA","DATA FFYRDD "]
[41,"TRAFFIC FLOW","LLIF TRAFFIG"]
[42,"PRIVATE SECTOR DWELLING STOCK","STOC ANHEDDAU'R SECTOR PREIFAT"]
[43,"LAND AREA","ARWYNEBEDD TIR"]
[44,"2018 POPULATION PROJECTIONS DATA","2018 DATA AMCANESTYNIADAU POBLOGAETH"]
[45,"POPULATION ESTIMATES DATA","DATA AMCANGYFRIFON POBLOGAETH"]
[46,"HOUSING DATA - GCF","DATA TAI - CYLLID CYFALAF CYFFREDINOL"]
[47,"LAND DRAINAGE PRECEPTS","PRAESEPTAU DRAENIO TIR"]
[48,"LENGTH OF PROTECTED COASTLINE","HYD YR ARFORDIR A WARCHODIR"]
[49,"FARMS","FFERMYDD"]
[50,"HOMELESSNESS DATA","DATA DIGARTREFEDD"]
[51,"Planning Applications Received","Ceisiadau Cynllunio a Gafwyd"]
[52,"Dependent children in out of work families ","Plant dibynnol mewn teuluoedd di-waith"]
[53,"A County road length (km)","Hyd ffyrdd A y sir (km)"]
[54,"Built-up A County road length (km)","Hyd ffyrdd A y sir, adeiledig (km)"]
[55,"B and C road length (km)","Hyd ffyrdd B ac C (km)"]
[56,"Built-up B and C road length (km)","Hyd ffyrdd B ac C, adeiledig (km)"]
[57,"Minor surfaced road length (km)","Hyd is-ffyrdd â wyneb caled (km)"]
[58,"Built-up minor surfaced road length (km)","Hyd is-ffyrdd â wyneb caled, adeiledig (km)"]
[59,"Traffic flow (vehicles)","Llif traffig (cerbydau)"]
[60,"Total Homelessness Decisions","Cyfanswm Penderfyniadau Digartrefedd"]
[61,"Private sector dwelling stock","Stoc anheddau'r sector preifat"]
[62,"Land area (hectares)","Arwynebedd tir (hectarau)"]
[63,"Motor vehicle traffic on all principal roads","Traffig cerbydau modur ar yr holl prf ffyrdd"]
[64,"Owner-occupied, privately rented, intermediate and other tenures","Yn eiddo i berchen-feddianwyr, wedi'u rhentu'n breifat, deiliadaeth ganolradd a deiliadaethau eraill"]
[65,"Area in hectares","Arwynebedd mewn hectarau"]
[66,"Total population","Cyfanswm y boblogaeth"]
[67,"Total population (projections)","Cyfanswm y boblogaeth (amcanestyniad)"]
[68,"Population aged 3 (projections)","Poblogaeth 3 oed (amcanestyniad)"]
[69,"Population aged 3 to 11 (projections)","Poblogaeth 3 i 11 oed (amcanestyniad)"]
[70,"Population aged 3 to 16 (projections)","Poblogaeth 3 i 16 oed (amcanestyniad)"]
[71,"Population aged 11 to 15 (projections)","Poblogaeth 11 i 15 oed (amcanestyniad)"]
[72,"Population aged 11 to 20 (projections)","Poblogaeth 11 i 20 oed (amcanestyniad)"]
[73,"Population aged 16 and over (projections)","Poblogaeth 16 oed a throsodd (amcanestyniad)"]
[74,"Population aged 16 to 18 (projections)","Poblogaeth 16 i 18 oed (amcanestyniad)"]
[75,"Population aged 0 to 17 (projections)","Poblogaeth 0 i 17 oed (amcanestyniad)"]
[76,"Population aged 18 to 64 (projections)","Poblogaeth 18 i 64 oed (amcanestyniad)"]
[77,"Population aged 18 and over (projections)","Poblogaeth 18 oed a throsodd (amcanestyniad)"]
[78,"Population aged under 60 (projections)","Poblogaeth o dan 60 oed (amcanestyniad)"]
[79,"Population aged 60 and over (projections)","Poblogaeth 60 oed a throsodd (amcanestyniad)"]
[80,"Population aged 85 and over (projections)","Poblogaeth 85 oed a throsodd (amcanestyniad)"]
[81,"Working age population    (16-65M/F) (projections)","Poblogaeth oedran gweithio (16-65G/B) (amcanestyniad)"]
[82,"Mid-Year Population Estimates all ages","Amcangyfrifon Poblogaeth Ganol Blwyddyn, pob oed"]
[83,"Mid-Year Population Estimates aged 18 and over","Amcangyfrifon Poblogaeth Ganol Blwyddyn, 18 oed a throsodd"]
[84,"Mid-Year Population Estimates aged 65 and over","Amcangyfrifon Poblogaeth Ganol Blwyddyn, 65 oed a throsodd"]
[85,"Amount spent on mandatory Disabled Facilities Grants completed by area (£s)","Swm a wariwyd ar grantiau cyfleusterau i'r anabl wedi'u cwblhau (£s)"]
[86,"Amount spent on DFGs completed (£s)","Swm a wariwyd ar grantiau cyfleusterau i'r anabl wedi'u cwblhau (£s)"]
[87,"Special levies by Internal Drainage Boards","Ardollau arbennig gan Fyrddau Draenio Mewnol"]
[88,"Length (km)","Hyd (km)"]
[89,"Number of economically active farms","Nifer y ffermydd economaidd weithgar"]
[90,"Land Drainage Precepts","Praeseptau Draenio Tir"]
[91,"Length of protected coastline","Hyd yr arfordir a warchodir"]
[92,"Number of Farms","Nifer y Ffermydd"]
[93,"HM Revenue & Customs","Cyllid a Thollau EM"]
[143,"Total street lighting units","Cyfanswm yr unedau goleuadau stryd"]
[144,"TRADING PREMISES","EIDDO MASNACHU"]
[145,"Number of Trading Premises","Nifer yr Eiddo Masnachu"]
[146,"FOOD PREMISES","EIDDO BWYD"]
[147,"Number of Food Premises","Nifer yr Eiddo Bwyd"]
[148,"MORTALITY DATA","DATA MARWOLAETHAU"]
[149,"Registered number of deaths","Nifer y marwolaethau wedi'u cofrestru"]
[150,"COUNCIL TAX REDUCTION SCHEMES (CTRS) DATA","DATA CYNLLUNIAU GOSTYNGIADAU'R DRETH GYNGOR "]
[151,"CTRS Caseload ","Llwyth achosion Cynlluniau Gostyngiadau'r Dreth Gyngor "]
[152,"CTRS Expenditure","Gwariant Cynlluniau Gostyngiadau'r Dreth Gyngor"]
[152.5,"Covid-19 CTRS support","Cefnogaeth CTRS Covid-19 "]
[153,"Valuation Office Agency (VOA)","Asiantaeth y Swyddfa Brisio"]
[154,"STREET LIGHTING UNITS","UNEDAU GOLEUADAU STRYD"]
[158,"Office for National Statistics (ONS)","Y Swyddfa Ystadegau Gwladol"]
[159,"SHIPS ARRIVING AT PORTS","LLONGAU SY'N CYRRAEDD PORTHLADDOEDD"]
[160,"Number of ships arriving at ports","Nifer y llongau sy'n cyrraedd porthladdoedd"]
[161,"TOURISM DATA","DATA TWRISTIAETH"]
[162,"Tourist nights (thousands) inc AirBnb","Nosweithiau twristiaid (miloedd) gan gynnwys AirBnb"]
[163,"Tourist days (thousands)","Diwrnodau twristiaid (miloedd)"]
[164,"Scarborough Tourism Economic Activity Monitor (STEAM) ","Scarborough Tourism Economic Activity Monitor (STEAM) "]
[165,"UNEMPLOYMENT BENEFIT CLAIMANT COUNT DATA","DATA AR GANRAN YR HAWLWYR BUDD-DAL DIWEITHDRA"]
[166,"Numbers of claimants","Nifer yr hawlwyr"]
[178,"HOUSING BENEFIT CLAIMANTS","NIFER YR HAWLWYR BUDD-DAL TAI"]
[179,"BENEFITS CLAIMANTS DATA","DATA AR HAWLWYR BUDD-DALIADAU"]
[192,"Claimant Count Data","Data Hawlwyr Budd-dal "]
[193,"Housing Benefit Claimants","Nifer Yr Hawlwyr Budd-dal Tai"]
[194,"Number of Income Support Claimants, aged 18-64","Nifer yr Hawlwyr Cymhorthdal Incwm, 18-64 oed"]
[195,"Number of Income Based Jobseeker’s Allowance Recipients, aged 18-64","Nifer y Derbynwyr Lwfans Ceisio Swydd ar Sail Incwm, 18-64 oed"]
[196,"Number of Pension Credit Claimants, aged 18-64","Nifer yr hawlwyr Credyd Pensiwn, 18-64 oed"]
[197,"Number of people on Universal Credit (not in employment) aged 18-64","Nifer y rhai sydd yn derbyn Credyd Cynhwysol (ddim mewn cyflogaeth) 18-64 oed"]
[198,"Total number of Income Support Claimants","Cyfanswm yr Hawlwyr Cymhorthdal Incwm"]
[199,"Total number of Income Based Jobseeker’s Allowance Recipients","Cyfanswm y Derbynwyr Lwfans Ceisio Swydd ar Sail Incwm"]
[200,"Total number of Pension Credit Claimants","Cyfanswm Hawlwyr Credyd Pensiwn"]
[201,"Total number of people on Universal Credit (not in employment)","Cyfanswm y rhai sy’n derbyn Credyd Cynhwysol (ddim mewn cyflogaeth)"]
[202,"Number of Severe Disablement Allowance Claimants aged 18-64","Nifer yr Hawlwyr Lwfans Anabledd Difrifol, 18-64 oed"]
[203,"Number of Disability Living Allowance Claimants aged 18-64","Nifer yr Hawlwyr Lwfans Byw i'r Anabl, 18-64 oed",null,"To use",1]
[204,"Number of Personal Independence Payment Claimants aged 18-64","Nifer yr Hawlwyr Taliad Annibyniaeth Bersonol sydd yn 18-64 oed",2,{"$f":"IF('iaith - language'!$K$1=2,Text!B142,Text!C142)","v":"Dewiswch / Select"}]
[205,"Pension Credit (PC) claimants aged 65+","Hawlwyr Credyd Pensiwn, 65 oed a hŷn ",3,{"$f":"IF('iaith - language'!$K$1=2,Text!B143,Text!C143)","v":"Sir Ynys Môn"}]
[206,"Total Income Support (IS), Job Seekers Allowance (JSA) and Pension Credit (PC) claimants","Cyfanswn yr hawlwyr Cymhorthdal Incwm, Lwfans Ceisio Gwaith, a Chredyd Pensiwn",4,{"$f":"IF('iaith - language'!$K$1=2,Text!B144,Text!C144)","v":"Gwynedd"}]
[207,"Severe Disablement Allowence (SDA) and Disability Living Allowence (DLA) claimants aged 18-64","Pobl (18-64) sy'n hawlio Lwfans Anabledd Difrifol a Lwfans Byw i'r Anabl",5,{"$f":"IF('iaith - language'!$K$1=2,Text!B145,Text!C145)","v":"Conwy"}]
[208,"Department for Work and Pensions (DWP) ","Yr Adran Gwaith a Phensiynau (DWP)",6,{"$f":"IF('iaith - language'!$K$1=2,Text!B146,Text!C146)","v":"Sir Ddinbych"}]
[209,"NOMIS official labour market statistics","NOMIS ystadegau swyddogol y farchnad lafur",7,{"$f":"IF('iaith - language'!$K$1=2,Text!B147,Text!C147)","v":"Sir y Fflint"}]
[210,"NOMIS official labour market statistics and Department for Work and Pensions (DWP)","NOMIS ystadegau swyddogol y farchnad lafur a Yr Adran Gwaith a Phensiynau (DWP)",8,{"$f":"IF('iaith - language'!$K$1=2,Text!B148,Text!C148)","v":"Wrecsam"}]
[271,"LGFPSettlement@Gov.Wales","LGFPSettlement@Llyw.Cymru",9,{"$f":"IF('iaith - language'!$K$1=2,Text!B149,Text!C149)","v":"Powys"}]
[272,"Maritime and shipping statistics, Department for Transport","Ystadegau morol a llongau, Yr Adran Drafnidiaeth",10,{"$f":"IF('iaith - language'!$K$1=2,Text!B150,Text!C150)","v":"Sir Ceredigion"}]
[273,"*Data not submitted","*Data heb ei gyflwyno",11,{"$f":"IF('iaith - language'!$K$1=2,Text!B151,Text!C151)","v":"Sir Benfro"}]
[null,"LA name English","LA name Welsh",12,{"$f":"IF('iaith - language'!$K$1=2,Text!B152,Text!C152)","v":"Sir Gaerfyrddin"}]
[116,"Please select","Dewiswch / Select",13,{"$f":"IF('iaith - language'!$K$1=2,Text!B153,Text!C153)","v":"Abertawe"}]
[117,"Isle of Anglesey","Sir Ynys Môn",14,{"$f":"IF('iaith - language'!$K$1=2,Text!B154,Text!C154)","v":"Castell-nedd Port Talbot"}]
[118,"Gwynedd","Gwynedd",15,{"$f":"IF('iaith - language'!$K$1=2,Text!B155,Text!C155)","v":"Pen-y-bont ar Ogwr"}]
[119,"Conwy","Conwy",16,{"$f":"IF('iaith - language'!$K$1=2,Text!B156,Text!C156)","v":"Bro Morgannwg"}]
[120,"Denbighshire","Sir Ddinbych",17,{"$f":"IF('iaith - language'!$K$1=2,Text!B157,Text!C157)","v":"Rhondda Cynon Taf"}]
[121,"Flintshire","Sir y Fflint",18,{"$f":"IF('iaith - language'!$K$1=2,Text!B158,Text!C158)","v":"Merthyr Tudful"}]
[122,"Wrexham","Wrecsam",19,{"$f":"IF('iaith - language'!$K$1=2,Text!B159,Text!C159)","v":"Caerffili"}]
[123,"Powys","Powys",20,{"$f":"IF('iaith - language'!$K$1=2,Text!B160,Text!C160)","v":"Blaenau Gwent"}]
[124,"Ceredigion","Sir Ceredigion",21,{"$f":"IF('iaith - language'!$K$1=2,Text!B161,Text!C161)","v":"Torfaen"}]
[125,"Pembrokeshire","Sir Benfro",22,{"$f":"IF('iaith - language'!$K$1=2,Text!B162,Text!C162)","v":"Sir Fynwy"}]
[126,"Carmarthenshire","Sir Gaerfyrddin",23,{"$f":"IF('iaith - language'!$K$1=2,Text!B163,Text!C163)","v":"Casnewydd"}]
[127,"Swansea","Abertawe",24,{"$f":"IF('iaith - language'!$K$1=2,Text!B164,Text!C164)","v":"Caerdydd"}]
[128,"Neath Port Talbot","Castell-nedd Port Talbot",null,{"$f":"IF('iaith - language'!$K$1=2,Text!B165,Text!C165)","v":"Cyfanswm AU "}]
[129,"Bridgend","Pen-y-bont ar Ogwr"]
[130,"The Vale of Glamorgan","Bro Morgannwg"]
[131,"Rhondda Cynon Taf","Rhondda Cynon Taf"]
[132,"Merthyr Tydfil","Merthyr Tudful"]
[133,"Caerphilly","Caerffili"]
[134,"Blaenau Gwent","Blaenau Gwent"]
[135,"Torfaen","Torfaen"]
[136,"Monmouthshire","Sir Fynwy"]
[137,"Newport","Casnewydd"]
[138,"Cardiff","Caerdydd"]
[139,"UA Total","Cyfanswm AU "]
[140,"1 The dataset 'Private Sector Dwelling Stock' was removed from the Revenue Support Grant settlement calculations, although is included within the General Capital Funding (GCF) formulae","1 Cafodd y set ddata 'Stoc Anheddau'r Sector Preifat' ei hepgor o'r cyfrifiadau ar gyfer y setliad Grant Cynnal Refeniw, ond mae wedi ei chynnwys yn y fformiwlâu ar gyfer Cyllid Cyfalaf Cyffredinol"]
[141,".. The data item is not available",".. Nid yw'r eitem ddata yma ar gael"]
[142,"Please note the published mid-year population have been dif"]
[271.5,"Council tax stock of properties","Stoc eiddo treth cyngor"]
[274,"Valuation Office Agency (VOA)","Asiantaeth y Swyddfa Brisio"]
[600,"Round 1 Data verification process - data for use in the 2023-24 Settlement","Proses wirio data Cylch 1 - data i'w defnyddio ar gyfer Setliad 2023-24"]
[601,"June 2021","Mehefin 2021"]
[602,"September 2021","Medi 2021"]
[603,"December 2021","Rhagfyr 2021"]
[604,"March 2022","Mawrth 2022"]
[605,"May 2022","Mai 2022"]
[606,"April 2022","Ebrill 2022"]
[607,"October 2021","Hydref 2021"]
[608,"November 2021","Tachwedd 2021"]
[609,"December 2021","Rhagfyr 2021"]
[610,"January 2022","Ionawr 2022"]
[611,"February 2022","Chwefror 2022"]
[612,"June 2022","Mehefin 2022"]
[613,"July 2022","Gorffennaf 2022"]
[614,"August 2022","Awst 2022"]
[615,"May 2021","Mai 2021"]
[616,"August 2021","Awst 2021"]
[300,"Data used in the 2022-23 Settlement - for information purposes only","Data a ddefnyddiwyd yn Setliad 2022-23 – er gwybodaeth yn unig"]
[301,"June 2020","Mehefin 2020"]
[302,"September 2020","Medi 2020"]
[303,"December 2020","Rhagfyr 2020"]
[304,"March 2021","Mawrth 2021"]
[305,"May 2021","Mai 2021"]
[306,"April 2021","Ebrill 2021"]
[307,"October 2020","Hydref 2020"]
[308,"November 2020","Tachwedd 2020"]
[309,"December 2020","Rhagfyr 2020"]
[310,"January 2021","Ionawr 2021"]
[311,"February 2021","Chwefror 2021"]
[312,"June 2021","Mehefin 2021"]
[313,"July 2021","Gorffennaf 2021"]
[314,"August 2021","Awst 2021"]
[315,"May 2020","Mai 2020"]
[316,"August 2020","Awst 2020"]
[400,"Data used in the 2021-22 Settlement - for information purposes only","Data a ddefnyddiwyd yn Setliad 2021-22 – er gwybodaeth yn unig"]
[401,"June 2019","Mehefin 2019"]
[{"$f":"A206+1","v":402},"September 2019","Medi 2019"]
[{"$f":"A207+1","v":403},"December 2019","Rhagfyr 2019"]
[404,"March 2020","Mawrth 2020"]
[405,"May 2020","Mai 2020"]
[406,"April 2020","Ebrill 2020"]
[407,"October 2019","Hydref 2019"]
[408,"November 2019","Tachwedd 2019"]
[409,"December 2019","Rhagfyr 2019"]
[410,"January 2020","Ionawr 2020"]
[411,"February 2020","Chwefror 2020"]
[412,"June 2020","Mehefin 2020"]
[413,"July 2020","Gorffennaf 2020"]
[414,"August 2020","Awst 2020"]
[415,"May 2019","Mai 2019"]
[416,"August 2019","Awst 2019"]
[500,"Data used in the 2020-21 Settlement - for information purposes only","Data a ddefnyddiwyd yn Setliad 2020-21 – er gwybodaeth yn unig"]
[{"$f":"A222+1","v":501},"June 2018","Mehefin 2018"]
[{"$f":"A223+1","v":502},"September 2018","Medi 2018"]
[{"$f":"A224+1","v":503},"December 2018","Rhagfyr 2018"]
[504,"March 2019","Mawrth 2019"]
[505,"May 2019","Mai 2019"]
[506,"April 2019","Ebrill 2019"]
[507,"October 2018","Hydref 2018"]
[508,"November 2018","Tachwedd 2018"]
[509,"December 2018","Rhagfyr 2018"]
[510,"January 2019","Ionawr 2019"]
[511,"February 2019","Chwefror 2019"]
[512,"June 2019","Mehefin 2019"]
[513,"July 2019","Gorffennaf 2019"]
[514,"August 2019","Awst 2019"]
[515,"May 2018","Mai 2018"]
[516,"August 2018","Awst 2018"]

{"sheet":"queryformround1","index":2,"n_rows":138,"n_cols":11,"rows_kept":138,"merged":[[17,2,17,8],[18,2,18,8],[19,2,19,8],[24,2,25,2],[24,3,25,3],[24,4,25,4],[24,5,25,5],[24,6,25,6],[26,6,29,6],[32,6,46,6],[47,6,49,6],[47,8,49,8],[58,6,60,6],[62,6,63,6],[64,6,74,6],[75,6,78,6],[79,6,82,6],[83,6,86,6],[87,6,90,6],[91,6,94,6],[95,6,98,6],[99,6,102,6],[103,3,104,3],[103,6,106,6],[107,6,110,6],[111,6,114,6],[115,6,118,6],[119,6,122,6],[123,6,126,6],[128,2,133,2],[128,4,133,4],[128,6,133,6],[128,8,133,8]]}
[2,null,{"$f":"IF('iaith - language'!K1=2,VLOOKUP(A1,Text!A3:C316,2),VLOOKUP(A1,Text!A3:C318,3))","v":"Proses gwiriad data cylch 1"}]
[]
[3,null,{"$f":"IF('iaith - language'!K1=2,VLOOKUP(A3,Text!A3:C316,2),VLOOKUP(A3,Text!A3:C318,3))","v":"Dewiswch enw eich awdurdod:"}]
[]
[4,null,{"$f":"IF('iaith - language'!$K$1=2,VLOOKUP(A5,Text!$A$3:$C$402,2,0),VLOOKUP(A5,Text!$A$3:$C$402,3,0))","v":"Disgyblion mewn ysgolion annibynnol"}]
[5,null,{"$f":"IF('iaith - language'!$K$1=2,VLOOKUP(A6,Text!$A$3:$C$402,2,0),VLOOKUP(A6,Text!$A$3:$C$402,3,0))","v":"Gofynnir ichi roi gwybod inni am unrhyw ddisgyblion sy'n cael eu haddysgu mewn ysgolion annibynnol ar gyfer disgyblion nad ydynt ar ddatganiad anghenion addysgol arbennig (ac eithrio ysgolion arbennig)"}]
[6,null,{"$f":"IF('iaith - language'!$K$1=2,VLOOKUP(A7,Text!$A$3:$C$402,2,0),VLOOKUP(A7,Text!$A$3:$C$402,3,0))","v":"y mae eich awdurdod yn talu ffïoedd dysgu llawn ar eu cyfer, fel sydd wedi'i gofnodi ar llinell 1.3.5 o adroddiad alldro Adran 52. Dylid darparu'r wybodaeth hon ar gyfer y sefyllfa fel yr oedd ym mis Ebrill 2022."}]
[7,null,{"$f":"IF('iaith - language'!$K$1=2,VLOOKUP(A8,Text!$A$3:$C$402,2,0),VLOOKUP(A8,Text!$A$3:$C$402,3,0))","v":"Rhoddir credyd yn uniongyrchol ar gyfer y disgyblion hyn yn yr Asesiadau o Wariant Safonol, felly mae'n bwysig iawn fod yr wybodaeth hon yn cael ei darparu er mwyn sicrhau bod y cyfrifiadau'n gywir. "}]
[8,null,{"$f":"IF('iaith - language'!$K$1=2,VLOOKUP(A9,Text!$A$3:$C$402,2,0),VLOOKUP(A9,Text!$A$3:$C$402,3,0))","v":"Darparwch y ffigurau inni yn y tabl isod. Sylwch y cymerir yn ganiataol nad oes disgyblion o'r fath os na ddywedir yn wahanol. "}]
[9]
[4,null,{"$f":"IF('iaith - language'!$K$1=2,VLOOKUP(A10,Text!$A$3:$C$402,2,0),VLOOKUP(A10,Text!$A$3:$C$402,3,0))","v":"Set ddata"},{"$f":"IF('iaith - language'!$K$1=2,VLOOKUP(A11,Text!$A$3:$C$402,2,0),VLOOKUP(A11,Text!$A$3:$C$402,3,0))","v":"Disgyblion mewn ysgolion annibynnol"}]
[10,null,{"$f":"IF('iaith - language'!$K$1=2,VLOOKUP(A12,Text!$A$3:$C$402,2,0),VLOOKUP(A12,Text!$A$3:$C$402,3,0))","v":"Disgyblion mewn grwpiau blwyddyn meithrin 2 neu flwyddyn derbyn mewn ysgolion meithrin neu gynradd"}]
[11,null,{"$f":"IF('iaith - language'!$K$1=2,VLOOKUP(A13,Text!$A$3:$C$402,2,0),VLOOKUP(A13,Text!$A$3:$C$402,3,0))","v":"Disgyblion ysgol gynradd yng ngrwpiau blwyddyn 1 ac uwch"}]
[12,null,{"$f":"IF('iaith - language'!$K$1=2,VLOOKUP(A14,Text!$A$3:$C$402,2,0),VLOOKUP(A14,Text!$A$3:$C$402,3,0))","v":"Disgyblion ysgol uwchradd yng ngrwpiau blwyddyn 10 ac 11"}]
[13,null,{"$f":"IF('iaith - language'!$K$1=2,VLOOKUP(A15,Text!$A$3:$C$402,2,0),VLOOKUP(A15,Text!$A$3:$C$402,3,0))","v":"Disgyblion ysgol uwchradd yng ngrwpiau blwyddyn 7-11"}]
[14,null,{"$f":"IF('iaith - language'!$K$1=2,VLOOKUP(A16,Text!$A$3:$C$402,2,0),VLOOKUP(A16,Text!$A$3:$C$402,3,0))","v":"Disgyblion ysgol uwchradd yng ngrwpiau blwyddyn 12-14"}]
[]
[15,null,{"$f":"IF('iaith - language'!K1=2,VLOOKUP(A18,Text!A3:C316,2),VLOOKUP(A18,Text!A3:C318,3))","v":"Defnyddir y data heb fod yn ariannol, a gasglwyd yn wreiddiol gan Awdurdodau Lleol, i gyfrifo Asesiadau o Wariant Safonol (SSAs) yn y Setliad Llywodraeth Leol. "}]
[16,null,{"$f":"IF('iaith - language'!K1=2,VLOOKUP(A19,Text!A3:C316,2),VLOOKUP(A19,Text!A3:C318,3))","v":"Mae'r data hyn eisoes wedi bod drwy amryw o brosesau sicrhau ansawdd a gwirio cyn iddynt gael eu cyhoeddi."}]
[17,null,{"$f":"IF('iaith - language'!K1=2,VLOOKUP(A20,Text!A3:C316,2),VLOOKUP(A20,Text!A3:C318,3))","v":"Ni ddylid defnyddio’r broses wirio hon i roi sylw i amcangyfrifon sydd wedi eu cyhoeddi os yw’r newidiadau dan sylw yn rhai mân. Yn hytrach, nod y broses yw sicrhau bod unrhyw gamgymeriadau sylweddol yn y data heb fod yn ariannol, neu newidiadau o bwys iddynt, yn cael eu nodi cyn cyhoeddi'r Setliad Llywodraeth Leol. "}]
[]
[18,null,{"$f":"IF('iaith - language'!$K$1=2,VLOOKUP(A22,Text!$A$3:$C$402,2,0),VLOOKUP(A22,Text!$A$3:$C$402,3,0))","v":"Ffurflen ymholiadau ar gyfer sylwadau ar y data"}]
[]
[{"$nulls":4},20,21,22,23,25]
[19,null,{"$f":"IF('iaith - language'!$K$1=2,VLOOKUP(A25,Text!$A$3:$C$402,2,0),VLOOKUP(A25,Text!$A$3:$C$402,3,0))","v":"Pwnc"},{"$f":"IF('iaith - language'!$K$1=2,VLOOKUP(A10,Text!$A$3:$C$402,2,0),VLOOKUP(A10,Text!$A$3:$C$402,3,0))","v":"Set ddata"},{"$f":"IF('iaith - language'!$K$1=2,VLOOKUP(E24,Text!$A$3:$C$402,2,0),VLOOKUP(E24,Text!$A$3:$C$402,3,0))","v":"Pwynt data"},{"$f":"IF('iaith - language'!$K$1=2,VLOOKUP(F24,Text!$A$3:$C$402,2,0),VLOOKUP(F24,Text!$A$3:$C$402,3,0))","v":"Ffigur gwiriad"},{"$f":"IF('iaith - language'!K1=2,VLOOKUP(G24,Text!A3:C316,2),VLOOKUP(G24,Text!A3:C318,3))","v":"Ystorfa Ddata"},{"$f":"IF('iaith - language'!K1=2,VLOOKUP(H24,Text!A3:C316,2),VLOOKUP(H24,Text!A3:C318,3))","v":"Ffigur diwygiedig"},{"$f":"IF('iaith - language'!K1=2,VLOOKUP(I24,Text!A3:C316,2),VLOOKUP(I24,Text!A3:C318,3))","v":"Sylwadau/Ymholiadau"},24]
[{"$nulls":7},{"$f":"IF('iaith - language'!K1=2,VLOOKUP(J25,Text!A3:C316,2),VLOOKUP(J25,Text!A3:C318,3))","v":"Dim ond os cytunwyd gan yr ystorfa ddata"},{"$f":"IF('iaith - language'!K1=2,VLOOKUP(J26,Text!A3:C316,2),VLOOKUP(J26,Text!A3:C318,3))","v":"Os ydych chi wedi cael cytundeb yr ystorfa ddata berthnasol i ddiwygio eich data cyhoeddedig, rhowch fanylion "},26]
[38,51,{"$f":"IF('iaith - language'!$K$1=2,VLOOKUP(A27,Text!$A$3:$C$402,2,0),VLOOKUP(A27,Text!$A$3:$C$402,3,0))","v":"CEISIADAU CYNLLUNIO"},{"$f":"IF('iaith - language'!$K$1=2,VLOOKUP(B27,Text!$A$3:$C$402,2,0),VLOOKUP(B27,Text!$A$3:$C$402,3,0))","v":"Ceisiadau Cynllunio a Gafwyd"},{"$f":"VLOOKUP(0,'2023-24 Settlement data '!$B$7:$ET$32,K27,FALSE)","v":"Mehefin 2021"},{"$f":"VLOOKUP(Text!$F$130,'2023-24 Settlement data '!$B$9:$EU$30,$K27,FALSE)","v":{"$error":"#N/A"}},{"$f":"IF('iaith - language'!K1=2,VLOOKUP(A29,Text!A3:C316,2),VLOOKUP(A29,Text!A3:C318,3))","v":"Llywodraeth Cymru"},null,null,109,3]
[{"$nulls":4},{"$f":"VLOOKUP(0,'2023-24 Settlement data '!$B$7:$ET$32,K28,FALSE)","v":"Medi 2021"},{"$f":"VLOOKUP(Text!$F$130,'2023-24 Settlement data '!$B$9:$EU$30,$K28,FALSE)","v":{"$error":"#N/A"}},{"$nulls":3},110,4]
[29,{"$nulls":3},{"$f":"VLOOKUP(0,'2023-24 Settlement data '!$B$7:$ET$32,K29,FALSE)","v":"Rhagfyr 2021"},{"$f":"VLOOKUP(Text!$F$130,'2023-24 Settlement data '!$B$9:$EU$30,$K29,FALSE)","v":{"$error":"#N/A"}},{"$nulls":3},111,5]
[{"$nulls":4},{"$f":"VLOOKUP(0,'2023-24 Settlement data '!$B$7:$ET$32,K30,FALSE)","v":"Mawrth 2022"},{"$f":"VLOOKUP(Text!$F$130,'2023-24 Settlement data '!$B$9:$EU$30,$K30,FALSE)","v":{"$error":"#N/A"}},{"$nulls":3},112,6]
[42,64,{"$f":"IF('iaith - language'!$K$1=2,VLOOKUP(A31,Text!$A$3:$C$402,2,0),VLOOKUP(A31,Text!$A$3:$C$402,3,0))","v":"STOC ANHEDDAU'R SECTOR PREIFAT"},{"$f":"IF('iaith - language'!$K$1=2,VLOOKUP(B31,Text!$A$3:$C$402,2,0),VLOOKUP(B31,Text!$A$3:$C$402,3,0))","v":"Yn eiddo i berchen-feddianwyr, wedi'u rhentu'n breifat, deiliadaeth ganolradd a deiliadaethau eraill"},{"$f":"VLOOKUP(0,'2022-23 Settlement data'!$B$7:$ET$32,K31,FALSE)","v":"2019-20"},{"$f":"VLOOKUP(Text!$F$130,'2022-23 Settlement data'!$B$9:$EU$30,$K31,FALSE)","v":{"$error":"#N/A"}},{"$f":"IF('iaith - language'!K1=2,VLOOKUP(A29,Text!A3:C316,2),VLOOKUP(A29,Text!A3:C318,3))","v":"Llywodraeth Cymru"},null,"Do not verify ",null,{"$f":"K30+1","v":7}]
[43,65,{"$f":"IF('iaith - language'!$K$1=2,VLOOKUP(A32,Text!$A$3:$C$402,2,0),VLOOKUP(A32,Text!$A$3:$C$402,3,0))","v":"ARWYNEBEDD TIR"},{"$f":"IF('iaith - language'!$K$1=2,VLOOKUP(B32,Text!$A$3:$C$402,2,0),VLOOKUP(B32,Text!$A$3:$C$402,3,0))","v":"Arwynebedd mewn hectarau"},{"$f":"VLOOKUP(0,'2023-24 Settlement data '!$B$7:$ET$32,K32,FALSE)","v":"Mai 2022"},{"$f":"VLOOKUP(Text!$F$130,'2023-24 Settlement data '!$B$9:$EU$30,$K32,FALSE)","v":{"$error":"#N/A"}},{"$f":"IF('iaith - language'!K1=2,VLOOKUP(A29,Text!A3:C316,2),VLOOKUP(A29,Text!A3:C318,3))","v":"Llywodraeth Cymru"},null,null,113,{"$f":"K31+1","v":8}]
[44,66,{"$f":"IF('iaith - language'!$K$1=2,VLOOKUP(A33,Text!$A$3:$C$402,2,0),VLOOKUP(A33,Text!$A$3:$C$402,3,0))","v":"2018 DATA AMCANESTYNIADAU POBLOGAETH"},{"$f":"IF('iaith - language'!$K$1=2,VLOOKUP(B33,Text!$A$3:$C$402,2,0),VLOOKUP(B33,Text!$A$3:$C$402,3,0))","v":"Cyfanswm y boblogaeth"},{"$f":"VLOOKUP(0,'2023-24 Settlement data '!$B$7:$ET$32,K33,FALSE)","v":"2023"},{"$f":"VLOOKUP(Text!$F$130,'2023-24 Settlement data '!$B$9:$EU$30,$K33,FALSE)","v":{"$error":"#N/A"}},{"$f":"IF('iaith - language'!K1=2,VLOOKUP(A29,Text!A3:C316,2),VLOOKUP(A29,Text!A3:C318,3))","v":"Llywodraeth Cymru"},null,null,99,{"$f":"K32+1","v":9}]
[null,68,null,{"$f":"IF('iaith - language'!$K$1=2,VLOOKUP(B34,Text!$A$3:$C$402,2,0),VLOOKUP(B34,Text!$A$3:$C$402,3,0))","v":"Poblogaeth 3 oed (amcanestyniad)"},{"$f":"VLOOKUP(0,'2023-24 Settlement data '!$B$7:$ET$32,K34,FALSE)","v":"2023"},{"$f":"VLOOKUP(Text!$F$130,'2023-24 Settlement data '!$B$9:$EU$30,$K34,FALSE)","v":{"$error":"#N/A"}},{"$nulls":4},10]
[null,69,null,{"$f":"IF('iaith - language'!$K$1=2,VLOOKUP(B35,Text!$A$3:$C$402,2,0),VLOOKUP(B35,Text!$A$3:$C$402,3,0))","v":"Poblogaeth 3 i 11 oed (amcanestyniad)"},{"$f":"VLOOKUP(0,'2023-24 Settlement data '!$B$7:$ET$32,K35,FALSE)","v":"2023"},{"$f":"VLOOKUP(Text!$F$130,'2023-24 Settlement data '!$B$9:$EU$30,$K35,FALSE)","v":{"$error":"#N/A"}},{"$nulls":4},11]
[null,70,null,{"$f":"IF('iaith - language'!$K$1=2,VLOOKUP(B36,Text!$A$3:$C$402,2,0),VLOOKUP(B36,Text!$A$3:$C$402,3,0))","v":"Poblogaeth 3 i 16 oed (amcanestyniad)"},{"$f":"VLOOKUP(0,'2023-24 Settlement data '!$B$7:$ET$32,K36,FALSE)","v":"2023"},{"$f":"VLOOKUP(Text!$F$130,'2023-24 Settlement data '!$B$9:$EU$30,$K36,FALSE)","v":{"$error":"#N/A"}},{"$nulls":4},12]
[null,71,null,{"$f":"IF('iaith - language'!$K$1=2,VLOOKUP(B37,Text!$A$3:$C$402,2,0),VLOOKUP(B37,Text!$A$3:$C$402,3,0))","v":"Poblogaeth 11 i 15 oed (amcanestyniad)"},{"$f":"VLOOKUP(0,'2023-24 Settlement data '!$B$7:$ET$32,K37,FALSE)","v":"2023"},{"$f":"VLOOKUP(Text!$F$130,'2023-24 Settlement data '!$B$9:$EU$30,$K37,FALSE)","v":{"$error":"#N/A"}},{"$nulls":4},13]
[null,72,null,{"$f":"IF('iaith - language'!$K$1=2,VLOOKUP(B38,Text!$A$3:$C$402,2,0),VLOOKUP(B38,Text!$A$3:$C$402,3,0))","v":"Poblogaeth 11 i 20 oed (amcanestyniad)"},{"$f":"VLOOKUP(0,'2023-24 Settlement data '!$B$7:$ET$32,K38,FALSE)","v":"2023"},{"$f":"VLOOKUP(Text!$F$130,'2023-24 Settlement data '!$B$9:$EU$30,$K38,FALSE)","v":{"$error":"#N/A"}},{"$nulls":4},14]
[null,73,null,{"$f":"IF('iaith - language'!$K$1=2,VLOOKUP(B39,Text!$A$3:$C$402,2,0),VLOOKUP(B39,Text!$A$3:$C$402,3,0))","v":"Poblogaeth 16 oed a throsodd (amcanestyniad)"},{"$f":"VLOOKUP(0,'2023-24 Settlement data '!$B$7:$ET$32,K39,FALSE)","v":"2023"},{"$f":"VLOOKUP(Text!$F$130,'2023-24 Settlement data '!$B$9:$EU$30,$K39,FALSE)","v":{"$error":"#N/A"}},{"$nulls":4},15]
[null,74,null,{"$f":"IF('iaith - language'!$K$1=2,VLOOKUP(B40,Text!$A$3:$C$402,2,0),VLOOKUP(B40,Text!$A$3:$C$402,3,0))","v":"Poblogaeth 16 i 18 oed (amcanestyniad)"},{"$f":"VLOOKUP(0,'2023-24 Settlement data '!$B$7:$ET$32,K40,FALSE)","v":"2023"},{"$f":"VLOOKUP(Text!$F$130,'2023-24 Settlement data '!$B$9:$EU$30,$K40,FALSE)","v":{"$error":"#N/A"}},{"$nulls":4},16]
[null,75,null,{"$f":"IF('iaith - language'!$K$1=2,VLOOKUP(B41,Text!$A$3:$C$402,2,0),VLOOKUP(B41,Text!$A$3:$C$402,3,0))","v":"Poblogaeth 0 i 17 oed (amcanestyniad)"},{"$f":"VLOOKUP(0,'2023-24 Settlement data '!$B$7:$ET$32,K41,FALSE)","v":"2023"},{"$f":"VLOOKUP(Text!$F$130,'2023-24 Settlement data '!$B$9:$EU$30,$K41,FALSE)","v":{"$error":"#N/A"}},{"$nulls":4},17]
[null,76,null,{"$f":"IF('iaith - language'!$K$1=2,VLOOKUP(B42,Text!$A$3:$C$402,2,0),VLOOKUP(B42,Text!$A$3:$C$402,3,0))","v":"Poblogaeth 18 i 64 oed (amcanestyniad)"},{"$f":"VLOOKUP(0,'2023-24 Settlement data '!$B$7:$ET$32,K42,FALSE)","v":"2023"},{"$f":"VLOOKUP(Text!$F$130,'2023-24 Settlement data '!$B$9:$EU$30,$K42,FALSE)","v":{"$error":"#N/A"}},{"$nulls":4},18]
[null,77,null,{"$f":"IF('iaith - language'!$K$1=2,VLOOKUP(B43,Text!$A$3:$C$402,2,0),VLOOKUP(B43,Text!$A$3:$C$402,3,0))","v":"Poblogaeth 18 oed a throsodd (amcanestyniad)"},{"$f":"VLOOKUP(0,'2023-24 Settlement data '!$B$7:$ET$32,K43,FALSE)","v":"2023"},{"$f":"VLOOKUP(Text!$F$130,'2023-24 Settlement data '!$B$9:$EU$30,$K43,FALSE)","v":{"$error":"#N/A"}},{"$nulls":4},19]
[null,78,null,{"$f":"IF('iaith - language'!$K$1=2,VLOOKUP(B44,Text!$A$3:$C$402,2,0),VLOOKUP(B44,Text!$A$3:$C$402,3,0))","v":"Poblogaeth o dan 60 oed (amcanestyniad)"},{"$f":"VLOOKUP(0,'2023-24 Settlement data '!$B$7:$ET$32,K44,FALSE)","v":"2023"},{"$f":"VLOOKUP(Text!$F$130,'2023-24 Settlement data '!$B$9:$EU$30,$K44,FALSE)","v":{"$error":"#N/A"}},{"$nulls":4},20]
[null,79,null,{"$f":"IF('iaith - language'!$K$1=2,VLOOKUP(B45,Text!$A$3:$C$402,2,0),VLOOKUP(B45,Text!$A$3:$C$402,3,0))","v":"Poblogaeth 60 oed a throsodd (amcanestyniad)"},{"$f":"VLOOKUP(0,'2023-24 Settlement data '!$B$7:$ET$32,K45,FALSE)","v":"2023"},{"$f":"VLOOKUP(Text!$F$130,'2023-24 Settlement data '!$B$9:$EU$30,$K45,FALSE)","v":{"$error":"#N/A"}},{"$nulls":4},21]
[null,80,null,{"$f":"IF('iaith - language'!$K$1=2,VLOOKUP(B46,Text!$A$3:$C$402,2,0),VLOOKUP(B46,Text!$A$3:$C$402,3,0))","v":"Poblogaeth 85 oed a throsodd (amcanestyniad)"},{"$f":"VLOOKUP(0,'2023-24 Settlement data '!$B$7:$ET$32,K46,FALSE)","v":"2023"},{"$f":"VLOOKUP(Text!$F$130,'2023-24 Settlement data '!$B$9:$EU$30,$K46,FALSE)","v":{"$error":"#N/A"}},{"$nulls":4},22]
[null,81,null,{"$f":"IF('iaith - language'!$K$1=2,VLOOKUP(B47,Text!$A$3:$C$402,2,0),VLOOKUP(B47,Text!$A$3:$C$402,3,0))","v":"Poblogaeth oedran gweithio (16-65G/B) (amcanestyniad)"},{"$f":"VLOOKUP(0,'2023-24 Settlement data '!$B$7:$ET$32,K47,FALSE)","v":"2023"},{"$f":"VLOOKUP(Text!$F$130,'2023-24 Settlement data '!$B$9:$EU$30,$K47,FALSE)","v":{"$error":"#N/A"}},{"$nulls":4},23]
[45,82,{"$f":"IF('iaith - language'!$K$1=2,VLOOKUP(A48,Text!$A$3:$C$402,2,0),VLOOKUP(A48,Text!$A$3:$C$402,3,0))","v":"DATA AMCANGYFRIFON POBLOGAETH"},{"$f":"IF('iaith - language'!$K$1=2,VLOOKUP(B48,Text!$A$3:$C$402,2,0),VLOOKUP(B48,Text!$A$3:$C$402,3,0))","v":"Amcangyfrifon Poblogaeth Ganol Blwyddyn, pob oed"},{"$f":"VLOOKUP(0,'2023-24 Settlement data '!$B$7:$ET$32,K48,FALSE)","v":"2020"},{"$f":"VLOOKUP(Text!$F$130,'2023-24 Settlement data '!$B$9:$EU$30,$K48,FALSE)","v":{"$error":"#N/A"}},{"$f":"IF('iaith - language'!K1=2,VLOOKUP(A29,Text!A3:C316,2),VLOOKUP(A29,Text!A3:C318,3))","v":"Llywodraeth Cymru"},{"$nulls":3},24]
[null,83,null,{"$f":"IF('iaith - language'!$K$1=2,VLOOKUP(B49,Text!$A$3:$C$402,2,0),VLOOKUP(B49,Text!$A$3:$C$402,3,0))","v":"Amcangyfrifon Poblogaeth Ganol Blwyddyn, 18 oed a throsodd"},{"$f":"VLOOKUP(0,'2023-24 Settlement data '!$B$7:$ET$32,K49,FALSE)","v":"2020"},{"$f":"VLOOKUP(Text!$F$130,'2023-24 Settlement data '!$B$9:$EU$30,$K49,FALSE)","v":{"$error":"#N/A"}},{"$nulls":4},25]
[null,84,null,{"$f":"IF('iaith - language'!$K$1=2,VLOOKUP(B50,Text!$A$3:$C$402,2,0),VLOOKUP(B50,Text!$A$3:$C$402,3,0))","v":"Amcangyfrifon Poblogaeth Ganol Blwyddyn, 65 oed a throsodd"},{"$f":"VLOOKUP(0,'2023-24 Settlement data '!$B$7:$ET$32,K50,FALSE)","v":"2020"},{"$f":"VLOOKUP(Text!$F$130,'2023-24 Settlement data '!$B$9:$EU$30,$K50,FALSE)","v":{"$error":"#N/A"}},{"$nulls":4},26]
[46,85,{"$f":"IF('iaith - language'!$K$1=2,VLOOKUP(A51,Text!$A$3:$C$402,2,0),VLOOKUP(A51,Text!$A$3:$C$402,3,0))","v":"DATA TAI - CYLLID CYFALAF CYFFREDINOL"},{"$f":"IF('iaith - language'!$K$1=2,VLOOKUP(B51,Text!$A$3:$C$402,2,0),VLOOKUP(B51,Text!$A$3:$C$402,3,0))","v":"Swm a wariwyd ar grantiau cyfleusterau i'r anabl wedi'u cwblhau (£s)"},{"$f":"VLOOKUP(0,'2022-23 Settlement data'!$B$7:$ET$32,K51,FALSE)","v":"2018-19"},{"$f":"VLOOKUP(Text!$F$130,'2023-24 Settlement data '!$B$9:$EU$30,$K51,FALSE)","v":{"$error":"#N/A"}},{"$f":"IF('iaith - language'!$K$1=2,VLOOKUP(J51,Text!$A$4:$C$198,2,FALSE),VLOOKUP(J51,Text!$A$4:$C$198,3,FALSE))","v":"Llywodraeth Cymru"},null,"Do not verify ",29,27]
[47,87,{"$f":"IF('iaith - language'!$K$1=2,VLOOKUP(A52,Text!$A$3:$C$402,2,0),VLOOKUP(A52,Text!$A$3:$C$402,3,0))","v":"PRAESEPTAU DRAENIO TIR"},{"$f":"IF('iaith - language'!$K$1=2,VLOOKUP(B52,Text!$A$3:$C$402,2,0),VLOOKUP(B52,Text!$A$3:$C$402,3,0))","v":"Ardollau arbennig gan Fyrddau Draenio Mewnol"},{"$f":"VLOOKUP(0,'2023-24 Settlement data '!$B$7:$ET$32,K52,FALSE)","v":"2022-23"},{"$f":"VLOOKUP(Text!$F$130,'2023-24 Settlement data '!$B$9:$EU$30,$K52,FALSE)","v":{"$error":"#N/A"}},{"$f":"IF('iaith - language'!$K$1=2,VLOOKUP(J52,Text!$A$4:$C$198,2,FALSE),VLOOKUP(J52,Text!$A$4:$C$198,3,FALSE))","v":"Llywodraeth Cymru"},null,null,29,28]
[48,88,{"$f":"IF('iaith - language'!$K$1=2,VLOOKUP(A53,Text!$A$3:$C$402,2,0),VLOOKUP(A53,Text!$A$3:$C$402,3,0))","v":"HYD YR ARFORDIR A WARCHODIR"},{"$f":"IF('iaith - language'!$K$1=2,VLOOKUP(B53,Text!$A$3:$C$402,2,0),VLOOKUP(B53,Text!$A$3:$C$402,3,0))","v":"Hyd (km)"},{"$f":"VLOOKUP(0,'2023-24 Settlement data '!$B$7:$ET$32,K53,FALSE)","v":"Mai 2022"},{"$f":"VLOOKUP(Text!$F$130,'2023-24 Settlement data '!$B$9:$EU$30,$K53,FALSE)","v":{"$error":"#N/A"}},{"$f":"IF('iaith - language'!$K$1=2,VLOOKUP(J53,Text!$A$4:$C$198,2,FALSE),VLOOKUP(J53,Text!$A$4:$C$198,3,FALSE))","v":"Llywodraeth Cymru"},null,null,29,29]
[49,89,{"$f":"IF('iaith - language'!$K$1=2,VLOOKUP(A54,Text!$A$3:$C$402,2,0),VLOOKUP(A54,Text!$A$3:$C$402,3,0))","v":"FFERMYDD"},{"$f":"IF('iaith - language'!$K$1=2,VLOOKUP(B54,Text!$A$3:$C$402,2,0),VLOOKUP(B54,Text!$A$3:$C$402,3,0))","v":"Nifer y ffermydd economaidd weithgar"},{"$f":"VLOOKUP(0,'2023-24 Settlement data '!$B$7:$ET$32,K54,FALSE)","v":"2021"},{"$f":"VLOOKUP(Text!$F$130,'2023-24 Settlement data '!$B$9:$EU$30,$K54,FALSE)","v":{"$error":"#N/A"}},{"$f":"IF('iaith - language'!$K$1=2,VLOOKUP(J54,Text!$A$4:$C$198,2,FALSE),VLOOKUP(J54,Text!$A$4:$C$198,3,FALSE))","v":"Llywodraeth Cymru"},null,null,29,30]
[144,145,{"$f":"IF('iaith - language'!$K$1=2,VLOOKUP(A55,Text!$A$3:$C$402,2,0),VLOOKUP(A55,Text!$A$3:$C$402,3,0))","v":"EIDDO MASNACHU"},{"$f":"IF('iaith - language'!$K$1=2,VLOOKUP(B55,Text!$A$3:$C$402,2,0),VLOOKUP(B55,Text!$A$3:$C$402,3,0))","v":"Nifer yr Eiddo Masnachu"},{"$f":"VLOOKUP(0,'2023-24 Settlement data '!$B$7:$ET$32,K55,FALSE)","v":"Mawrth 2022"},{"$f":"VLOOKUP(Text!$F$130,'2023-24 Settlement data '!$B$9:$EU$30,$K55,FALSE)","v":{"$error":"#N/A"}},{"$f":"IF('iaith - language'!$K$1=2,VLOOKUP(J56,Text!$A$4:$C$198,2,FALSE),VLOOKUP(J56,Text!$A$4:$C$198,3,FALSE))","v":"Asiantaeth y Swyddfa Brisio"},null,null,115,31]
[146,147,{"$f":"IF('iaith - language'!$K$1=2,VLOOKUP(A56,Text!$A$3:$C$402,2,0),VLOOKUP(A56,Text!$A$3:$C$402,3,0))","v":"EIDDO BWYD"},{"$f":"IF('iaith - language'!$K$1=2,VLOOKUP(B56,Text!$A$3:$C$402,2,0),VLOOKUP(B56,Text!$A$3:$C$402,3,0))","v":"Nifer yr Eiddo Bwyd"},{"$f":"VLOOKUP(0,'2023-24 Settlement data '!$B$7:$ET$32,K56,FALSE)","v":"Mawrth 2022"},{"$f":"VLOOKUP(Text!$F$130,'2023-24 Settlement data '!$B$9:$EU$30,$K56,FALSE)","v":{"$error":"#N/A"}},{"$f":"IF('iaith - language'!$K$1=2,VLOOKUP(J56,Text!$A$4:$C$198,2,FALSE),VLOOKUP(J56,Text!$A$4:$C$198,3,FALSE))","v":"Asiantaeth y Swyddfa Brisio"},null,null,153,32]
[154,143,{"$f":"IF('iaith - language'!$K$1=2,VLOOKUP(A57,Text!$A$3:$C$402,2,0),VLOOKUP(A57,Text!$A$3:$C$402,3,0))","v":"UNEDAU GOLEUADAU STRYD"},{"$f":"IF('iaith - language'!$K$1=2,VLOOKUP(B57,Text!$A$3:$C$402,2,0),VLOOKUP(B57,Text!$A$3:$C$402,3,0))","v":"Cyfanswm yr unedau goleuadau stryd"},{"$f":"VLOOKUP(0,'2023-24 Settlement data '!$B$7:$ET$32,K57,FALSE)","v":"Ebrill 2022"},{"$f":"VLOOKUP(Text!$F$130,'2023-24 Settlement data '!$B$9:$EU$30,$K57,FALSE)","v":{"$error":"#N/A"}},{"$f":"IF('iaith - language'!$K$1=2,VLOOKUP(J57,Text!$A$4:$C$198,2,FALSE),VLOOKUP(J57,Text!$A$4:$C$198,3,FALSE))","v":"Llywodraeth Cymru"},null,null,29,33]
[148,149,{"$f":"IF('iaith - language'!$K$1=2,VLOOKUP(A58,Text!$A$3:$C$402,2,0),VLOOKUP(A58,Text!$A$3:$C$402,3,0))","v":"DATA MARWOLAETHAU"},{"$f":"IF('iaith - language'!$K$1=2,VLOOKUP(B58,Text!$A$3:$C$402,2,0),VLOOKUP(B58,Text!$A$3:$C$402,3,0))","v":"Nifer y marwolaethau wedi'u cofrestru"},{"$f":"VLOOKUP(0,'2023-24 Settlement data '!$B$7:$ET$32,K58,FALSE)","v":"2021"},{"$f":"VLOOKUP(Text!$F$130,'2023-24 Settlement data '!$B$9:$EU$30,$K58,FALSE)","v":{"$error":"#N/A"}},{"$f":"IF('iaith - language'!$K$1=2,VLOOKUP(J58,Text!$A$4:$C$198,2,FALSE),VLOOKUP(J58,Text!$A$4:$C$198,3,FALSE))","v":"Y Swyddfa Ystadegau Gwladol"},null,null,158,34]
[150,151,{"$f":"IF('iaith - language'!$K$1=2,VLOOKUP(A59,Text!$A$3:$C$402,2,0),VLOOKUP(A59,Text!$A$3:$C$402,3,0))","v":"DATA CYNLLUNIAU GOSTYNGIADAU'R DRETH GYNGOR "},{"$f":"IF('iaith - language'!$K$1=2,VLOOKUP(B59,Text!$A$3:$C$402,2,0),VLOOKUP(B59,Text!$A$3:$C$402,3,0))","v":"Llwyth achosion Cynlluniau Gostyngiadau'r Dreth Gyngor "},{"$f":"VLOOKUP(0,'2023-24 Settlement data '!$B$7:$ET$32,K59,FALSE)","v":"2021-22"},{"$f":"VLOOKUP(Text!$F$130,'2023-24 Settlement data '!$B$9:$EU$30,$K59,FALSE)","v":{"$error":"#N/A"}},{"$f":"IF('iaith - language'!$K$1=2,VLOOKUP(J59,Text!$A$4:$C$198,2,FALSE),VLOOKUP(J59,Text!$A$4:$C$198,3,FALSE))","v":"Llywodraeth Cymru"},null,null,29,35]
[null,152,null,{"$f":"IF('iaith - language'!$K$1=2,VLOOKUP(B60,Text!$A$3:$C$402,2,0),VLOOKUP(B60,Text!$A$3:$C$402,3,0))","v":"Gwariant Cynlluniau Gostyngiadau'r Dreth Gyngor"},{"$f":"VLOOKUP(0,'2023-24 Settlement data '!$B$7:$ET$32,K60,FALSE)","v":"2021-22"},{"$f":"VLOOKUP(Text!$F$130,'2023-24 Settlement data '!$B$9:$EU$30,$K60,FALSE)","v":{"$error":"#N/A"}},{"$nulls":4},36]
[null,152.5,null,{"$f":"IF('iaith - language'!$K$1=2,VLOOKUP(B61,Text!$A$3:$C$402,2,0),VLOOKUP(B61,Text!$A$3:$C$402,3,0))","v":"Cefnogaeth CTRS Covid-19 "},{"$f":"VLOOKUP(0,'2023-24 Settlement data '!$B$7:$ET$32,K61,FALSE)","v":"2021-22"},{"$f":"VLOOKUP(Text!$F$130,'2023-24 Settlement data '!$B$9:$EU$30,$K61,FALSE)","v":{"$error":"#N/A"}},{"$nulls":4},37]
[159,160,{"$f":"IF('iaith - language'!$K$1=2,VLOOKUP(A62,Text!$A$3:$C$402,2,0),VLOOKUP(A62,Text!$A$3:$C$402,3,0))","v":"LLONGAU SY'N CYRRAEDD PORTHLADDOEDD"},{"$f":"IF('iaith - language'!$K$1=2,VLOOKUP(B62,Text!$A$3:$C$402,2,0),VLOOKUP(B62,Text!$A$3:$C$402,3,0))","v":"Nifer y llongau sy'n cyrraedd porthladdoedd"},{"$f":"VLOOKUP(0,'2023-24 Settlement data '!$B$7:$ET$32,K62,FALSE)","v":"2021"},{"$f":"VLOOKUP(Text!$F$130,'2023-24 Settlement data '!$B$9:$EU$30,$K62,FALSE)","v":{"$error":"#N/A"}},{"$f":"IF('iaith - language'!$K$1=2,VLOOKUP(J62,Text!$A$4:$C$558,2,FALSE),VLOOKUP(J62,Text!$A$4:$C$558,3,FALSE))","v":"Ystadegau morol a llongau, Yr Adran Drafnidiaeth"},null,null,272,38]
[161,162,{"$f":"IF('iaith - language'!$K$1=2,VLOOKUP(A63,Text!$A$3:$C$402,2,0),VLOOKUP(A63,Text!$A$3:$C$402,3,0))","v":"DATA TWRISTIAETH"},{"$f":"IF('iaith - language'!$K$1=2,VLOOKUP(B63,Text!$A$3:$C$402,2,0),VLOOKUP(B63,Text!$A$3:$C$402,3,0))","v":"Nosweithiau twristiaid (miloedd) gan gynnwys AirBnb"},{"$f":"VLOOKUP(0,'2023-24 Settlement data '!$B$7:$ET$32,K63,FALSE)","v":"2019"},{"$f":"VLOOKUP(Text!$F$130,'2023-24 Settlement data '!$B$9:$EU$30,$K63,FALSE)","v":{"$error":"#N/A"}},{"$f":"IF('iaith - language'!$K$1=2,VLOOKUP(J63,Text!$A$4:$C$198,2,FALSE),VLOOKUP(J63,Text!$A$4:$C$198,3,FALSE))","v":"Scarborough Tourism Economic Activity Monitor (STEAM) "},null,null,164,39]
[null,163,null,{"$f":"IF('iaith - language'!$K$1=2,VLOOKUP(B64,Text!$A$3:$C$402,2,0),VLOOKUP(B64,Text!$A$3:$C$402,3,0))","v":"Diwrnodau twristiaid (miloedd)"},{"$f":"VLOOKUP(0,'2023-24 Settlement data '!$B$7:$ET$32,K64,FALSE)","v":"2019"},{"$f":"VLOOKUP(Text!$F$130,'2023-24 Settlement data '!$B$9:$EU$30,$K64,FALSE)","v":{"$error":"#N/A"}},{"$nulls":4},40]
[165,166,{"$f":"IF('iaith - language'!$K$1=2,VLOOKUP(A65,Text!$A$3:$C$402,2,0),VLOOKUP(A65,Text!$A$3:$C$402,3,0))","v":"DATA AR GANRAN YR HAWLWYR BUDD-DAL DIWEITHDRA"},{"$f":"IF('iaith - language'!$K$1=2,VLOOKUP(B65,Text!$A$3:$C$402,2,0),VLOOKUP(B65,Text!$A$3:$C$402,3,0))","v":"Nifer yr hawlwyr"},{"$f":"VLOOKUP(0,'2023-24 Settlement data '!$B$7:$ET$32,K65,FALSE)","v":"Hydref 2021"},{"$f":"VLOOKUP(Text!$F$130,'2023-24 Settlement data '!$B$9:$EU$30,$K65,FALSE)","v":{"$error":"#N/A"}},{"$f":"IF('iaith - language'!$K$1=2,VLOOKUP(B66,Text!$A$4:$C$198,2,FALSE),VLOOKUP(B66,Text!$A$4:$C$198,3,FALSE))","v":"NOMIS ystadegau swyddogol y farchnad lafur"},null,null,167,41]
[null,209,null,null,{"$f":"VLOOKUP(0,'2023-24 Settlement data '!$B$7:$ET$32,K66,FALSE)","v":"Tachwedd 2021"},{"$f":"VLOOKUP(Text!$F$130,'2023-24 Settlement data '!$B$9:$EU$30,$K66,FALSE)","v":{"$error":"#N/A"}},{"$nulls":3},{"$f":"J65+1","v":168},42]
[{"$nulls":4},{"$f":"VLOOKUP(0,'2023-24 Settlement data '!$B$7:$ET$32,K67,FALSE)","v":"Rhagfyr 2021"},{"$f":"VLOOKUP(Text!$F$130,'2023-24 Settlement data '!$B$9:$EU$30,$K67,FALSE)","v":{"$error":"#N/A"}},{"$nulls":3},169,43]
[{"$nulls":4},{"$f":"VLOOKUP(0,'2023-24 Settlement data '!$B$7:$ET$32,K68,FALSE)","v":"Ionawr 2022"},{"$f":"VLOOKUP(Text!$F$130,'2023-24 Settlement data '!$B$9:$EU$30,$K68,FALSE)","v":{"$error":"#N/A"}},{"$nulls":3},170,44]
[{"$nulls":4},{"$f":"VLOOKUP(0,'2023-24 Settlement data '!$B$7:$ET$32,K69,FALSE)","v":"Chwefror 2022"},{"$f":"VLOOKUP(Text!$F$130,'2023-24 Settlement data '!$B$9:$EU$30,$K69,FALSE)","v":{"$error":"#N/A"}},{"$nulls":3},171,45]
[{"$nulls":4},{"$f":"VLOOKUP(0,'2023-24 Settlement data '!$B$7:$ET$32,K70,FALSE)","v":"Mawrth 2022"},{"$f":"VLOOKUP(Text!$F$130,'2023-24 Settlement data '!$B$9:$EU$30,$K70,FALSE)","v":{"$error":"#N/A"}},{"$nulls":3},172,46]
[{"$nulls":4},{"$f":"VLOOKUP(0,'2023-24 Settlement data '!$B$7:$ET$32,K71,FALSE)","v":"Ebrill 2022"},{"$f":"VLOOKUP(Text!$F$130,'2023-24 Settlement data '!$B$9:$EU$30,$K71,FALSE)","v":{"$error":"#N/A"}},{"$nulls":3},173,47]
[{"$nulls":4},{"$f":"VLOOKUP(0,'2023-24 Settlement data '!$B$7:$ET$32,K72,FALSE)","v":"Mai 2022"},{"$f":"VLOOKUP(Text!$F$130,'2023-24 Settlement data '!$B$9:$EU$30,$K72,FALSE)","v":{"$error":"#N/A"}},{"$nulls":3},174,48]
[{"$nulls":4},{"$f":"VLOOKUP(0,'2023-24 Settlement data '!$B$7:$ET$32,K73,FALSE)","v":"Mehefin 2022"},{"$f":"VLOOKUP(Text!$F$130,'2023-24 Settlement data '!$B$9:$EU$30,$K73,FALSE)","v":{"$error":"#N/A"}},{"$nulls":3},175,49]
[{"$nulls":4},{"$f":"VLOOKUP(0,'2023-24 Settlement data '!$B$7:$ET$32,K74,FALSE)","v":"Gorffennaf 2022"},{"$f":"VLOOKUP(Text!$F$130,'2023-24 Settlement data '!$B$9:$EU$30,$K74,FALSE)","v":{"$error":"#N/A"}},{"$nulls":3},176,50]
[{"$nulls":4},{"$f":"VLOOKUP(0,'2023-24 Settlement data '!$B$7:$ET$32,K75,FALSE)","v":"Awst 2022"},{"$f":"VLOOKUP(Text!$F$130,'2023-24 Settlement data '!$B$9:$EU$30,$K75,FALSE)","v":{"$error":"#N/A"}},{"$nulls":3},177,51]
[179,194,{"$f":"IF('iaith - language'!$K$1=2,VLOOKUP(A76,Text!$A$3:$C$402,2,0),VLOOKUP(A76,Text!$A$3:$C$402,3,0))","v":"DATA AR HAWLWYR BUDD-DALIADAU"},{"$f":"IF('iaith - language'!$K$1=2,VLOOKUP(B76,Text!$A$3:$C$402,2,0),VLOOKUP(B76,Text!$A$3:$C$402,3,0))","v":"Nifer yr Hawlwyr Cymhorthdal Incwm, 18-64 oed"},{"$f":"VLOOKUP(0,'2023-24 Settlement data '!$B$7:$ET$32,K76,FALSE)","v":"Mai 2021"},{"$f":"VLOOKUP(Text!$F$130,'2023-24 Settlement data '!$B$9:$EU$30,$K76,FALSE)","v":{"$error":"#N/A"}},{"$f":"IF('iaith - language'!$K$1=2,VLOOKUP(B77,Text!$A$4:$C$198,2,FALSE),VLOOKUP(B77,Text!$A$4:$C$198,3,FALSE))","v":"Yr Adran Gwaith a Phensiynau (DWP)"},null,null,114,52]
[null,208,null,null,{"$f":"VLOOKUP(0,'2023-24 Settlement data '!$B$7:$ET$32,K77,FALSE)","v":"Awst 2021"},{"$f":"VLOOKUP(Text!$F$130,'2023-24 Settlement data '!$B$9:$EU$30,$K77,FALSE)","v":{"$error":"#N/A"}},{"$nulls":3},182,53]
[{"$nulls":4},{"$f":"VLOOKUP(0,'2023-24 Settlement data '!$B$7:$ET$32,K78,FALSE)","v":"Tachwedd 2021"},{"$f":"VLOOKUP(Text!$F$130,'2023-24 Settlement data '!$B$9:$EU$30,$K78,FALSE)","v":{"$error":"#N/A"}},{"$nulls":3},185,54]
[{"$nulls":4},{"$f":"VLOOKUP(0,'2023-24 Settlement data '!$B$7:$ET$32,K79,FALSE)","v":"Chwefror 2022"},{"$f":"VLOOKUP(Text!$F$130,'2023-24 Settlement data '!$B$9:$EU$30,$K79,FALSE)","v":{"$error":"#N/A"}},{"$nulls":3},188,55]
[null,195,null,{"$f":"IF('iaith - language'!$K$1=2,VLOOKUP(B80,Text!$A$3:$C$402,2,0),VLOOKUP(B80,Text!$A$3:$C$402,3,0))","v":"Nifer y Derbynwyr Lwfans Ceisio Swydd ar Sail Incwm, 18-64 oed"},{"$f":"VLOOKUP(0,'2023-24 Settlement data '!$B$7:$ET$32,K80,FALSE)","v":"Mai 2021"},{"$f":"VLOOKUP(Text!$F$130,'2023-24 Settlement data '!$B$9:$EU$30,$K80,FALSE)","v":{"$error":"#N/A"}},{"$f":"IF('iaith - language'!$K$1=2,VLOOKUP(B81,Text!$A$4:$C$198,2,FALSE),VLOOKUP(B81,Text!$A$4:$C$198,3,FALSE))","v":"NOMIS ystadegau swyddogol y farchnad lafur"},null,null,114,56]
[null,209,null,null,{"$f":"VLOOKUP(0,'2023-24 Settlement data '!$B$7:$ET$32,K81,FALSE)","v":"Awst 2021"},{"$f":"VLOOKUP(Text!$F$130,'2023-24 Settlement data '!$B$9:$EU$30,$K81,FALSE)","v":{"$error":"#N/A"}},{"$nulls":3},182,57]
[{"$nulls":4},{"$f":"VLOOKUP(0,'2023-24 Settlement data '!$B$7:$ET$32,K82,FALSE)","v":"Tachwedd 2021"},{"$f":"VLOOKUP(Text!$F$130,'2023-24 Settlement data '!$B$9:$EU$30,$K82,FALSE)","v":{"$error":"#N/A"}},{"$nulls":3},185,58]
[{"$nulls":4},{"$f":"VLOOKUP(0,'2023-24 Settlement data '!$B$7:$ET$32,K83,FALSE)","v":"Chwefror 2022"},{"$f":"VLOOKUP(Text!$F$130,'2023-24 Settlement data '!$B$9:$EU$30,$K83,FALSE)","v":{"$error":"#N/A"}},{"$nulls":3},188,59]
[null,196,null,{"$f":"IF('iaith - language'!$K$1=2,VLOOKUP(B84,Text!$A$3:$C$402,2,0),VLOOKUP(B84,Text!$A$3:$C$402,3,0))","v":"Nifer yr hawlwyr Credyd Pensiwn, 18-64 oed"},{"$f":"VLOOKUP(0,'2023-24 Settlement data '!$B$7:$ET$32,K84,FALSE)","v":"Mai 2021"},{"$f":"VLOOKUP(Text!$F$130,'2023-24 Settlement data '!$B$9:$EU$30,$K84,FALSE)","v":{"$error":"#N/A"}},{"$f":"IF('iaith - language'!$K$1=2,VLOOKUP(B85,Text!$A$4:$C$198,2,FALSE),VLOOKUP(B85,Text!$A$4:$C$198,3,FALSE))","v":"Yr Adran Gwaith a Phensiynau (DWP)"},null,null,114,60]
[null,208,null,null,{"$f":"VLOOKUP(0,'2023-24 Settlement data '!$B$7:$ET$32,K85,FALSE)","v":"Awst 2021"},{"$f":"VLOOKUP(Text!$F$130,'2023-24 Settlement data '!$B$9:$EU$30,$K85,FALSE)","v":{"$error":"#N/A"}},{"$nulls":3},182,61]
[{"$nulls":4},{"$f":"VLOOKUP(0,'2023-24 Settlement data '!$B$7:$ET$32,K86,FALSE)","v":"Tachwedd 2021"},{"$f":"VLOOKUP(Text!$F$130,'2023-24 Settlement data '!$B$9:$EU$30,$K86,FALSE)","v":{"$error":"#N/A"}},{"$nulls":3},185,62]
[{"$nulls":4},{"$f":"VLOOKUP(0,'2023-24 Settlement data '!$B$7:$ET$32,K87,FALSE)","v":"Chwefror 2022"},{"$f":"VLOOKUP(Text!$F$130,'2023-24 Settlement data '!$B$9:$EU$30,$K87,FALSE)","v":{"$error":"#N/A"}},{"$nulls":3},188,63]
[null,197,null,{"$f":"IF('iaith - language'!$K$1=2,VLOOKUP(B88,Text!$A$3:$C$402,2,0),VLOOKUP(B88,Text!$A$3:$C$402,3,0))","v":"Nifer y rhai sydd yn derbyn Credyd Cynhwysol (ddim mewn cyflogaeth) 18-64 oed"},{"$f":"VLOOKUP(0,'2023-24 Settlement data '!$B$7:$ET$32,K88,FALSE)","v":"Mai 2021"},{"$f":"VLOOKUP(Text!$F$130,'2023-24 Settlement data '!$B$9:$EU$30,$K88,FALSE)","v":{"$error":"#N/A"}},{"$f":"IF('iaith - language'!$K$1=2,VLOOKUP(B89,Text!$A$4:$C$198,2,FALSE),VLOOKUP(B89,Text!$A$4:$C$198,3,FALSE))","v":"Yr Adran Gwaith a Phensiynau (DWP)"},null,null,114,64]
[null,208,null,null,{"$f":"VLOOKUP(0,'2023-24 Settlement data '!$B$7:$ET$32,K89,FALSE)","v":"Awst 2021"},{"$f":"VLOOKUP(Text!$F$130,'2023-24 Settlement data '!$B$9:$EU$30,$K89,FALSE)","v":{"$error":"#N/A"}},{"$nulls":3},182,65]
[{"$nulls":4},{"$f":"VLOOKUP(0,'2023-24 Settlement data '!$B$7:$ET$32,K90,FALSE)","v":"Tachwedd 2021"},{"$f":"VLOOKUP(Text!$F$130,'2023-24 Settlement data '!$B$9:$EU$30,$K90,FALSE)","v":{"$error":"#N/A"}},{"$nulls":3},185,66]
[{"$nulls":4},{"$f":"VLOOKUP(0,'2023-24 Settlement data '!$B$7:$ET$32,K91,FALSE)","v":"Chwefror 2022"},{"$f":"VLOOKUP(Text!$F$130,'2023-24 Settlement data '!$B$9:$EU$30,$K91,FALSE)","v":{"$error":"#N/A"}},{"$nulls":3},188,67]
[null,198,null,{"$f":"IF('iaith - language'!$K$1=2,VLOOKUP(B92,Text!$A$3:$C$402,2,0),VLOOKUP(B92,Text!$A$3:$C$402,3,0))","v":"Cyfanswm yr Hawlwyr Cymhorthdal Incwm"},{"$f":"VLOOKUP(0,'2023-24 Settlement data '!$B$7:$ET$32,K92,FALSE)","v":"Mai 2021"},{"$f":"VLOOKUP(Text!$F$130,'2023-24 Settlement data '!$B$9:$EU$30,$K92,FALSE)","v":{"$error":"#N/A"}},{"$f":"IF('iaith - language'!$K$1=2,VLOOKUP(B93,Text!$A$4:$C$198,2,FALSE),VLOOKUP(B93,Text!$A$4:$C$198,3,FALSE))","v":"Yr Adran Gwaith a Phensiynau (DWP)"},null,null,114,68]
[null,208,null,null,{"$f":"VLOOKUP(0,'2023-24 Settlement data '!$B$7:$ET$32,K93,FALSE)","v":"Awst 2021"},{"$f":"VLOOKUP(Text!$F$130,'2023-24 Settlement data '!$B$9:$EU$30,$K93,FALSE)","v":{"$error":"#N/A"}},{"$nulls":3},182,69]
[{"$nulls":4},{"$f":"VLOOKUP(0,'2023-24 Settlement data '!$B$7:$ET$32,K94,FALSE)","v":"Tachwedd 2021"},{"$f":"VLOOKUP(Text!$F$130,'2023-24 Settlement data '!$B$9:$EU$30,$K94,FALSE)","v":{"$error":"#N/A"}},{"$nulls":3},185,70]
[{"$nulls":4},{"$f":"VLOOKUP(0,'2023-24 Settlement data '!$B$7:$ET$32,K95,FALSE)","v":"Chwefror 2022"},{"$f":"VLOOKUP(Text!$F$130,'2023-24 Settlement data '!$B$9:$EU$30,$K95,FALSE)","v":{"$error":"#N/A"}},{"$nulls":3},188,71]
[null,199,null,{"$f":"IF('iaith - language'!$K$1=2,VLOOKUP(B96,Text!$A$3:$C$402,2,0),VLOOKUP(B96,Text!$A$3:$C$402,3,0))","v":"Cyfanswm y Derbynwyr Lwfans Ceisio Swydd ar Sail Incwm"},{"$f":"VLOOKUP(0,'2023-24 Settlement data '!$B$7:$ET$32,K96,FALSE)","v":"Mai 2021"},{"$f":"VLOOKUP(Text!$F$130,'2023-24 Settlement data '!$B$9:$EU$30,$K96,FALSE)","v":{"$error":"#N/A"}},{"$f":"IF('iaith - language'!$K$1=2,VLOOKUP(B97,Text!$A$4:$C$198,2,FALSE),VLOOKUP(B97,Text!$A$4:$C$198,3,FALSE))","v":"NOMIS ystadegau swyddogol y farchnad lafur"},null,null,114,{"$f":"K95+1","v":72}]
[null,209,null,null,{"$f":"VLOOKUP(0,'2023-24 Settlement data '!$B$7:$ET$32,K97,FALSE)","v":"Awst 2021"},{"$f":"VLOOKUP(Text!$F$130,'2023-24 Settlement data '!$B$9:$EU$30,$K97,FALSE)","v":{"$error":"#N/A"}},{"$nulls":3},182,73]
[{"$nulls":4},{"$f":"VLOOKUP(0,'2023-24 Settlement data '!$B$7:$ET$32,K98,FALSE)","v":"Tachwedd 2021"},{"$f":"VLOOKUP(Text!$F$130,'2023-24 Settlement data '!$B$9:$EU$30,$K98,FALSE)","v":{"$error":"#N/A"}},{"$nulls":3},185,74]
[{"$nulls":4},{"$f":"VLOOKUP(0,'2023-24 Settlement data '!$B$7:$ET$32,K99,FALSE)","v":"Chwefror 2022"},{"$f":"VLOOKUP(Text!$F$130,'2023-24 Settlement data '!$B$9:$EU$30,$K99,FALSE)","v":{"$error":"#N/A"}},{"$nulls":3},188,75]
[null,200,null,{"$f":"IF('iaith - language'!$K$1=2,VLOOKUP(B100,Text!$A$3:$C$402,2,0),VLOOKUP(B100,Text!$A$3:$C$402,3,0))","v":"Cyfanswm Hawlwyr Credyd Pensiwn"},{"$f":"VLOOKUP(0,'2023-24 Settlement data '!$B$7:$ET$32,K100,FALSE)","v":"Mai 2021"},{"$f":"VLOOKUP(Text!$F$130,'2023-24 Settlement data '!$B$9:$EU$30,$K100,FALSE)","v":{"$error":"#N/A"}},{"$f":"IF('iaith - language'!$K$1=2,VLOOKUP(B101,Text!$A$4:$C$198,2,FALSE),VLOOKUP(B101,Text!$A$4:$C$198,3,FALSE))","v":"Yr Adran Gwaith a Phensiynau (DWP)"},null,null,114,76]
[null,208,null,null,{"$f":"VLOOKUP(0,'2023-24 Settlement data '!$B$7:$ET$32,K101,FALSE)","v":"Awst 2021"},{"$f":"VLOOKUP(Text!$F$130,'2023-24 Settlement data '!$B$9:$EU$30,$K101,FALSE)","v":{"$error":"#N/A"}},{"$nulls":3},182,77]
[{"$nulls":4},{"$f":"VLOOKUP(0,'2023-24 Settlement data '!$B$7:$ET$32,K102,FALSE)","v":"Tachwedd 2021"},{"$f":"VLOOKUP(Text!$F$130,'2023-24 Settlement data '!$B$9:$EU$30,$K102,FALSE)","v":{"$error":"#N/A"}},{"$nulls":3},185,78]
[{"$nulls":4},{"$f":"VLOOKUP(0,'2023-24 Settlement data '!$B$7:$ET$32,K103,FALSE)","v":"Chwefror 2022"},{"$f":"VLOOKUP(Text!$F$130,'2023-24 Settlement data '!$B$9:$EU$30,$K103,FALSE)","v":{"$error":"#N/A"}},{"$nulls":3},188,79]
[null,201,null,{"$f":"IF('iaith - language'!$K$1=2,VLOOKUP(B104,Text!$A$3:$C$402,2,0),VLOOKUP(B104,Text!$A$3:$C$402,3,0))","v":"Cyfanswm y rhai sy’n derbyn Credyd Cynhwysol (ddim mewn cyflogaeth)"},{"$f":"VLOOKUP(0,'2023-24 Settlement data '!$B$7:$ET$32,K104,FALSE)","v":"Mai 2021"},{"$f":"VLOOKUP(Text!$F$130,'2023-24 Settlement data '!$B$9:$EU$30,$K104,FALSE)","v":{"$error":"#N/A"}},{"$f":"IF('iaith - language'!$K$1=2,VLOOKUP(B105,Text!$A$4:$C$198,2,FALSE),VLOOKUP(B105,Text!$A$4:$C$198,3,FALSE))","v":"Yr Adran Gwaith a Phensiynau (DWP)"},null,null,114,80]
[null,208,null,null,{"$f":"VLOOKUP(0,'2023-24 Settlement data '!$B$7:$ET$32,K105,FALSE)","v":"Awst 2021"},{"$f":"VLOOKUP(Text!$F$130,'2023-24 Settlement data '!$B$9:$EU$30,$K105,FALSE)","v":{"$error":"#N/A"}},{"$nulls":3},182,81]
[{"$nulls":4},{"$f":"VLOOKUP(0,'2023-24 Settlement data '!$B$7:$ET$32,K106,FALSE)","v":"Tachwedd 2021"},{"$f":"VLOOKUP(Text!$F$130,'2023-24 Settlement data '!$B$9:$EU$30,$K106,FALSE)","v":{"$error":"#N/A"}},{"$nulls":3},185,82]
[{"$nulls":4},{"$f":"VLOOKUP(0,'2023-24 Settlement data '!$B$7:$ET$32,K107,FALSE)","v":"Chwefror 2022"},{"$f":"VLOOKUP(Text!$F$130,'2023-24 Settlement data '!$B$9:$EU$30,$K107,FALSE)","v":{"$error":"#N/A"}},{"$nulls":3},188,83]
[null,202,null,{"$f":"IF('iaith - language'!$K$1=2,VLOOKUP(B108,Text!$A$3:$C$402,2,0),VLOOKUP(B108,Text!$A$3:$C$402,3,0))","v":"Nifer yr Hawlwyr Lwfans Anabledd Difrifol, 18-64 oed"},{"$f":"VLOOKUP(0,'2023-24 Settlement data '!$B$7:$ET$32,K108,FALSE)","v":"Mai 2021"},{"$f":"VLOOKUP(Text!$F$130,'2023-24 Settlement data '!$B$9:$EU$30,$K108,FALSE)","v":{"$error":"#N/A"}},{"$f":"IF('iaith - language'!$K$1=2,VLOOKUP(B109,Text!$A$4:$C$198,2,FALSE),VLOOKUP(B109,Text!$A$4:$C$198,3,FALSE))","v":"Yr Adran Gwaith a Phensiynau (DWP)"},null,null,114,84]
[null,208,null,null,{"$f":"VLOOKUP(0,'2023-24 Settlement data '!$B$7:$ET$32,K109,FALSE)","v":"Awst 2021"},{"$f":"VLOOKUP(Text!$F$130,'2023-24 Settlement data '!$B$9:$EU$30,$K109,FALSE)","v":{"$error":"#N/A"}},{"$nulls":3},182,85]
[{"$nulls":4},{"$f":"VLOOKUP(0,'2023-24 Settlement data '!$B$7:$ET$32,K110,FALSE)","v":"Tachwedd 2021"},{"$f":"VLOOKUP(Text!$F$130,'2023-24 Settlement data '!$B$9:$EU$30,$K110,FALSE)","v":{"$error":"#N/A"}},{"$nulls":3},185,86]
[{"$nulls":4},{"$f":"VLOOKUP(0,'2023-24 Settlement data '!$B$7:$ET$32,K111,FALSE)","v":"Chwefror 2022"},{"$f":"VLOOKUP(Text!$F$130,'2023-24 Settlement data '!$B$9:$EU$30,$K111,FALSE)","v":{"$error":"#N/A"}},{"$nulls":3},188,87]
[null,203,null,{"$f":"IF('iaith - language'!$K$1=2,VLOOKUP(B112,Text!$A$3:$C$402,2,0),VLOOKUP(B112,Text!$A$3:$C$402,3,0))","v":"Nifer yr Hawlwyr Lwfans Byw i'r Anabl, 18-64 oed"},{"$f":"VLOOKUP(0,'2023-24 Settlement data '!$B$7:$ET$32,K112,FALSE)","v":"Mai 2021"},{"$f":"VLOOKUP(Text!$F$130,'2023-24 Settlement data '!$B$9:$EU$30,$K112,FALSE)","v":{"$error":"#N/A"}},{"$f":"IF('iaith - language'!$K$1=2,VLOOKUP(B113,Text!$A$4:$C$198,2,FALSE),VLOOKUP(B113,Text!$A$4:$C$198,3,FALSE))","v":"Yr Adran Gwaith a Phensiynau (DWP)"},null,null,114,88]
[null,208,null,null,{"$f":"VLOOKUP(0,'2023-24 Settlement data '!$B$7:$ET$32,K113,FALSE)","v":"Awst 2021"},{"$f":"VLOOKUP(Text!$F$130,'2023-24 Settlement data '!$B$9:$EU$30,$K113,FALSE)","v":{"$error":"#N/A"}},{"$nulls":3},182,89]
[{"$nulls":4},{"$f":"VLOOKUP(0,'2023-24 Settlement data '!$B$7:$ET$32,K114,FALSE)","v":"Tachwedd 2021"},{"$f":"VLOOKUP(Text!$F$130,'2023-24 Settlement data '!$B$9:$EU$30,$K114,FALSE)","v":{"$error":"#N/A"}},{"$nulls":3},185,90]
[{"$nulls":4},{"$f":"VLOOKUP(0,'2023-24 Settlement data '!$B$7:$ET$32,K115,FALSE)","v":"Chwefror 2022"},{"$f":"VLOOKUP(Text!$F$130,'2023-24 Settlement data '!$B$9:$EU$30,$K115,FALSE)","v":{"$error":"#N/A"}},{"$nulls":3},188,91]
[null,204,null,{"$f":"IF('iaith - language'!$K$1=2,VLOOKUP(B116,Text!$A$3:$C$402,2,0),VLOOKUP(B116,Text!$A$3:$C$402,3,0))","v":"Nifer yr Hawlwyr Taliad Annibyniaeth Bersonol sydd yn 18-64 oed"},{"$f":"VLOOKUP(0,'2023-24 Settlement data '!$B$7:$ET$32,K116,FALSE)","v":"Mai 2021"},{"$f":"VLOOKUP(Text!$F$130,'2023-24 Settlement data '!$B$9:$EU$30,$K116,FALSE)","v":{"$error":"#N/A"}},{"$f":"IF('iaith - language'!$K$1=2,VLOOKUP(B117,Text!$A$4:$C$198,2,FALSE),VLOOKUP(B117,Text!$A$4:$C$198,3,FALSE))","v":"Yr Adran Gwaith a Phensiynau (DWP)"},null,null,114,92]
[null,208,null,null,{"$f":"VLOOKUP(0,'2023-24 Settlement data '!$B$7:$ET$32,K117,FALSE)","v":"Awst 2021"},{"$f":"VLOOKUP(Text!$F$130,'2023-24 Settlement data '!$B$9:$EU$30,$K117,FALSE)","v":{"$error":"#N/A"}},{"$nulls":3},182,93]
[{"$nulls":4},{"$f":"VLOOKUP(0,'2023-24 Settlement data '!$B$7:$ET$32,K118,FALSE)","v":"Tachwedd 2021"},{"$f":"VLOOKUP(Text!$F$130,'2023-24 Settlement data '!$B$9:$EU$30,$K118,FALSE)","v":{"$error":"#N/A"}},{"$nulls":3},185,94]
[{"$nulls":4},{"$f":"VLOOKUP(0,'2023-24 Settlement data '!$B$7:$ET$32,K119,FALSE)","v":"Chwefror 2022"},{"$f":"VLOOKUP(Text!$F$130,'2023-24 Settlement data '!$B$9:$EU$30,$K119,FALSE)","v":{"$error":"#N/A"}},{"$nulls":3},188,95]
[null,205,null,{"$f":"IF('iaith - language'!$K$1=2,VLOOKUP(B120,Text!$A$3:$C$402,2,0),VLOOKUP(B120,Text!$A$3:$C$402,3,0))","v":"Hawlwyr Credyd Pensiwn, 65 oed a hŷn "},{"$f":"VLOOKUP(0,'2023-24 Settlement data '!$B$7:$ET$32,K120,FALSE)","v":"Mai 2021"},{"$f":"VLOOKUP(Text!$F$130,'2023-24 Settlement data '!$B$9:$EU$30,$K120,FALSE)","v":{"$error":"#N/A"}},{"$f":"IF('iaith - language'!$K$1=2,VLOOKUP(B121,Text!$A$4:$C$198,2,FALSE),VLOOKUP(B121,Text!$A$4:$C$198,3,FALSE))","v":"Yr Adran Gwaith a Phensiynau (DWP)"},null,null,114,96]
[null,208,null,null,{"$f":"VLOOKUP(0,'2023-24 Settlement data '!$B$7:$ET$32,K121,FALSE)","v":"Awst 2021"},{"$f":"VLOOKUP(Text!$F$130,'2023-24 Settlement data '!$B$9:$EU$30,$K121,FALSE)","v":{"$error":"#N/A"}},{"$nulls":3},182,97]
[{"$nulls":4},{"$f":"VLOOKUP(0,'2023-24 Settlement data '!$B$7:$ET$32,K122,FALSE)","v":"Tachwedd 2021"},{"$f":"VLOOKUP(Text!$F$130,'2023-24 Settlement data '!$B$9:$EU$30,$K122,FALSE)","v":{"$error":"#N/A"}},{"$nulls":3},185,98]
[{"$nulls":4},{"$f":"VLOOKUP(0,'2023-24 Settlement data '!$B$7:$ET$32,K123,FALSE)","v":"Chwefror 2022"},{"$f":"VLOOKUP(Text!$F$130,'2023-24 Settlement data '!$B$9:$EU$30,$K123,FALSE)","v":{"$error":"#N/A"}},{"$nulls":3},188,99]
[null,206,null,{"$f":"IF('iaith - language'!$K$1=2,VLOOKUP(B124,Text!$A$3:$C$402,2,0),VLOOKUP(B124,Text!$A$3:$C$402,3,0))","v":"Cyfanswn yr hawlwyr Cymhorthdal Incwm, Lwfans Ceisio Gwaith, a Chredyd Pensiwn"},{"$f":"VLOOKUP(0,'2023-24 Settlement data '!$B$7:$ET$32,K124,FALSE)","v":"Mai 2021"},{"$f":"VLOOKUP(Text!$F$130,'2023-24 Settlement data '!$B$9:$EU$30,$K124,FALSE)","v":{"$error":"#N/A"}},{"$f":"IF('iaith - language'!$K$1=2,VLOOKUP(B125,Text!$A$4:$C$198,2,FALSE),VLOOKUP(B125,Text!$A$4:$C$198,3,FALSE))","v":"NOMIS ystadegau swyddogol y farchnad lafur a Yr Adran Gwaith a Phensiynau (DWP)"},null,null,114,100]
[null,210,null,null,{"$f":"VLOOKUP(0,'2023-24 Settlement data '!$B$7:$ET$32,K125,FALSE)","v":"Awst 2021"},{"$f":"VLOOKUP(Text!$F$130,'2023-24 Settlement data '!$B$9:$EU$30,$K125,FALSE)","v":{"$error":"#N/A"}},{"$nulls":3},182,101]
[{"$nulls":4},{"$f":"VLOOKUP(0,'2023-24 Settlement data '!$B$7:$ET$32,K126,FALSE)","v":"Tachwedd 2021"},{"$f":"VLOOKUP(Text!$F$130,'2023-24 Settlement data '!$B$9:$EU$30,$K126,FALSE)","v":{"$error":"#N/A"}},{"$nulls":3},185,102]
[{"$nulls":4},{"$f":"VLOOKUP(0,'2023-24 Settlement data '!$B$7:$ET$32,K127,FALSE)","v":"Chwefror 2022"},{"$f":"VLOOKUP(Text!$F$130,'2023-24 Settlement data '!$B$9:$EU$30,$K127,FALSE)","v":{"$error":"#N/A"}},{"$nulls":3},188,103]
[271.5,274,{"$f":"IF('iaith - language'!$K$1=2,VLOOKUP(A128,Text!$A$3:$C$402,2,0),VLOOKUP(A128,Text!$A$3:$C$402,3,0))","v":"Stoc eiddo treth cyngor"},{"$f":"IF('iaith - language'!$K$1=2,VLOOKUP(A128,Text!$A$3:$C$402, 2, 0),VLOOKUP(A128,Text!$A$3:$C$402, 3,0))","v":"Stoc eiddo treth cyngor"},{"$f":"VLOOKUP(0,'2023-24 Settlement data '!$B$7:$ET$32,K128,FALSE)","v":"Mawrth 2022"},{"$f":"VLOOKUP(Text!$F$130,'2023-24 Settlement data '!$B$9:$EU$30,$K128,FALSE)","v":{"$error":"#N/A"}},{"$f":"IF('iaith - language'!$K$1=2,VLOOKUP(B128,Text!$A$4:$C$198,2,FALSE),VLOOKUP(B128,Text!$A$4:$C$198,3,FALSE))","v":"Asiantaeth y Swyddfa Brisio"},null,null,115,104]
[40,53,{"$f":"IF('iaith - language'!$K$1=2,VLOOKUP(A129,Text!$A$3:$C$402,2,0),VLOOKUP(A129,Text!$A$3:$C$402,3,0))","v":"DATA FFYRDD "},{"$f":"IF('iaith - language'!$K$1=2,VLOOKUP(B129,Text!$A$3:$C$402,2,0),VLOOKUP(B129,Text!$A$3:$C$402,3,0))","v":"Hyd ffyrdd A y sir (km)"},"March 2022",{"$f":"VLOOKUP(Text!$F$130,'2023-24 Settlement data '!$B$9:$EU$30,$K129,FALSE)","v":{"$error":"#N/A"}},{"$f":"IF('iaith - language'!$K$1=2,VLOOKUP(A130,Text!$A$4:$C$198,2,FALSE),VLOOKUP(A130,Text!$A$4:$C$198,3,FALSE))","v":"Llywodraeth Cymru"},{"$nulls":3},105]
[29,55,null,{"$f":"IF('iaith - language'!$K$1=2,VLOOKUP(B130,Text!$A$3:$C$402,2,0),VLOOKUP(B130,Text!$A$3:$C$402,3,0))","v":"Hyd ffyrdd B ac C (km)"},null,{"$f":"VLOOKUP(Text!$F$130,'2023-24 Settlement data '!$B$9:$EU$30,$K130,FALSE)","v":{"$error":"#N/A"}},{"$nulls":4},106]
[null,57,null,{"$f":"IF('iaith - language'!$K$1=2,VLOOKUP(B131,Text!$A$3:$C$402,2,0),VLOOKUP(B131,Text!$A$3:$C$402,3,0))","v":"Hyd is-ffyrdd â wyneb caled (km)"},null,{"$f":"VLOOKUP(Text!$F$130,'2023-24 Settlement data '!$B$9:$EU$30,$K131,FALSE)","v":{"$error":"#N/A"}},{"$nulls":4},107]
[null,54,null,{"$f":"IF('iaith - language'!$K$1=2,VLOOKUP(B132,Text!$A$3:$C$402,2,0),VLOOKUP(B132,Text!$A$3:$C$402,3,0))","v":"Hyd ffyrdd A y sir, adeiledig (km)"},null,{"$f":"VLOOKUP(Text!$F$130,'2023-24 Settlement data '!$B$9:$EU$30,$K132,FALSE)","v":{"$error":"#N/A"}},{"$nulls":4},108]
[null,56,null,{"$f":"IF('iaith - language'!$K$1=2,VLOOKUP(B133,Text!$A$3:$C$402,2,0),VLOOKUP(B133,Text!$A$3:$C$402,3,0))","v":"Hyd ffyrdd B ac C, adeiledig (km)"},null,{"$f":"VLOOKUP(Text!$F$130,'2023-24 Settlement data '!$B$9:$EU$30,$K133,FALSE)","v":{"$error":"#N/A"}},{"$nulls":4},109]
[null,58,null,{"$f":"IF('iaith - language'!$K$1=2,VLOOKUP(B134,Text!$A$3:$C$402,2,0),VLOOKUP(B134,Text!$A$3:$C$402,3,0))","v":"Hyd is-ffyrdd â wyneb caled, adeiledig (km)"},null,{"$f":"VLOOKUP(Text!$F$130,'2023-24 Settlement data '!$B$9:$EU$30,$K134,FALSE)","v":{"$error":"#N/A"}},{"$nulls":4},110]
[]
[27,null,{"$f":"IF('iaith - language'!$K$1=2,VLOOKUP(A136,Text!$A$3:$C$339,2,0),VLOOKUP(A136,Text!$A$3:$C$339,3,0))","v":"Yr Is-adran Polisi Cyllid Llywodraeth Leol a Chynaliadwyedd, Llywodraeth Cymru"}]
[]
[28,271,{"$f":"IF('iaith - language'!$K$1=2,VLOOKUP(A138,Text!$A$3:$C$339,2,0),VLOOKUP(A138,Text!$A$3:$C$339,3,0))","v":"I'w ddychwelyd drwy e-bost i:"},"LGFPSettlement@gov.wales"]

{"sheet":"2023-24 Settlement data ","index":3,"n_rows":41,"n_cols":111,"rows_kept":41,"merged":[[5,3,5,6],[5,41,5,51],[5,52,5,55],[5,56,5,59],[5,60,5,63],[5,64,5,67],[5,68,5,71],[5,72,5,75],[5,76,5,79],[5,80,5,83],[5,84,5,87],[5,88,5,91],[5,92,5,95],[5,96,5,99],[5,100,5,103]]}
[null,600,{"$f":"IF('iaith - language'!$K$1=2,VLOOKUP(B1,Text!$A$1:$C$353,2,FALSE),VLOOKUP(B1,Text!$A$1:$C$353,3,FALSE))","v":"Proses wirio data Cylch 1 - data i'w defnyddio ar gyfer Setliad 2023-24"}]
[]
[{"$nulls":3},51,{"$nulls":3},61,62,67,68,69,70,71,72,73,74,75,76,77,78,79,80,81,82,83,84,86,90,91,92,145,147,143,149,151,152,152.5,160,162,163,192,{"$nulls":10},194,{"$nulls":3},195,{"$nulls":3},196,{"$nulls":3},197,{"$nulls":3},198,{"$nulls":3},199,{"$nulls":3},200,{"$nulls":3},201,{"$nulls":3},202,{"$nulls":3},203,{"$nulls":3},204,{"$nulls":3},205,{"$nulls":3},206,{"$nulls":3},271.5,53,55,57,54,56,58]
[{"$nulls":3},601,{"$f":"D4+1","v":602},{"$f":"E4+1","v":603},604,605,605,{"$nulls":20},605,null,604,604,606,{"$nulls":7},607,{"$f":"AP4+1","v":608},{"$f":"AQ4+1","v":609},610,611,604,606,605,612,{"$f":"AX4+1","v":613},614,615,616,608,611,{"$f":"BA4","v":615},{"$f":"BB4","v":616},608,611,{"$f":"BE4","v":615},{"$f":"BF4","v":616},608,611,{"$f":"BI4","v":615},{"$f":"BJ4","v":616},608,611,{"$f":"BM4","v":615},{"$f":"BN4","v":616},608,611,{"$f":"BQ4","v":615},{"$f":"BR4","v":616},608,611,{"$f":"BU4","v":615},{"$f":"BV4","v":616},608,611,{"$f":"BY4","v":615},{"$f":"BZ4","v":616},608,611,{"$f":"CC4","v":615},{"$f":"CD4","v":616},608,611,{"$f":"CG4","v":615},{"$f":"CH4","v":616},608,611,{"$f":"CK4","v":615},{"$f":"CL4","v":616},608,611,{"$f":"CO4","v":615},{"$f":"CP4","v":616},608,611,{"$f":"CS4","v":615},{"$f":"CT4","v":616},608,611,{"$f":"G4","v":604},604,604,604,604,604,604]
[]
[{"$nulls":3},{"$f":"IF('iaith - language'!$K$1=2,VLOOKUP(D3,Text!$A$3:$C$353,2,FALSE),VLOOKUP(D3,Text!$A$3:$C$353,3,FALSE))","v":"Ceisiadau Cynllunio a Gafwyd"},{"$nulls":3},{"$f":"IF('iaith - language'!$K$1=2,VLOOKUP(H3,Text!$A$3:$C$353,2,FALSE),VLOOKUP(H3,Text!$A$3:$C$353,3,FALSE))","v":"Stoc anheddau'r sector preifat"},{"$f":"IF('iaith - language'!$K$1=2,VLOOKUP(I3,Text!$A$3:$C$353,2,FALSE),VLOOKUP(I3,Text!$A$3:$C$353,3,FALSE))","v":"Arwynebedd tir (hectarau)"},{"$f":"IF('iaith - language'!$K$1=2,VLOOKUP(J3,Text!$A$3:$C$353,2,FALSE),VLOOKUP(J3,Text!$A$3:$C$353,3,FALSE))","v":"Cyfanswm y boblogaeth (amcanestyniad)"},{"$f":"IF('iaith - language'!$K$1=2,VLOOKUP(K3,Text!$A$3:$C$353,2,FALSE),VLOOKUP(K3,Text!$A$3:$C$353,3,FALSE))","v":"Poblogaeth 3 oed (amcanestyniad)"},{"$f":"IF('iaith - language'!$K$1=2,VLOOKUP(L3,Text!$A$3:$C$353,2,FALSE),VLOOKUP(L3,Text!$A$3:$C$353,3,FALSE))","v":"Poblogaeth 3 i 11 oed (amcanestyniad)"},{"$f":"IF('iaith - language'!$K$1=2,VLOOKUP(M3,Text!$A$3:$C$353,2,FALSE),VLOOKUP(M3,Text!$A$3:$C$353,3,FALSE))","v":"Poblogaeth 3 i 16 oed (amcanestyniad)"},{"$f":"IF('iaith - language'!$K$1=2,VLOOKUP(N3,Text!$A$3:$C$353,2,FALSE),VLOOKUP(N3,Text!$A$3:$C$353,3,FALSE))","v":"Poblogaeth 11 i 15 oed (amcanestyniad)"},{"$f":"IF('iaith - language'!$K$1=2,VLOOKUP(O3,Text!$A$3:$C$353,2,FALSE),VLOOKUP(O3,Text!$A$3:$C$353,3,FALSE))","v":"Poblogaeth 11 i 20 oed (amcanestyniad)"},{"$f":"IF('iaith - language'!$K$1=2,VLOOKUP(P3,Text!$A$3:$C$353,2,FALSE),VLOOKUP(P3,Text!$A$3:$C$353,3,FALSE))","v":"Poblogaeth 16 oed a throsodd (amcanestyniad)"},{"$f":"IF('iaith - language'!$K$1=2,VLOOKUP(Q3,Text!$A$3:$C$353,2,FALSE),VLOOKUP(Q3,Text!$A$3:$C$353,3,FALSE))","v":"Poblogaeth 16 i 18 oed (amcanestyniad)"},{"$f":"IF('iaith - language'!$K$1=2,VLOOKUP(R3,Text!$A$3:$C$353,2,FALSE),VLOOKUP(R3,Text!$A$3:$C$353,3,FALSE))","v":"Poblogaeth 0 i 17 oed (amcanestyniad)"},{"$f":"IF('iaith - language'!$K$1=2,VLOOKUP(S3,Text!$A$3:$C$353,2,FALSE),VLOOKUP(S3,Text!$A$3:$C$353,3,FALSE))","v":"Poblogaeth 18 i 64 oed (amcanestyniad)"},{"$f":"IF('iaith - language'!$K$1=2,VLOOKUP(T3,Text!$A$3:$C$353,2,FALSE),VLOOKUP(T3,Text!$A$3:$C$353,3,FALSE))","v":"Poblogaeth 18 oed a throsodd (amcanestyniad)"},{"$f":"IF('iaith - language'!$K$1=2,VLOOKUP(U3,Text!$A$3:$C$353,2,FALSE),VLOOKUP(U3,Text!$A$3:$C$353,3,FALSE))","v":"Poblogaeth o dan 60 oed (amcanestyniad)"},{"$f":"IF('iaith - language'!$K$1=2,VLOOKUP(V3,Text!$A$3:$C$353,2,FALSE),VLOOKUP(V3,Text!$A$3:$C$353,3,FALSE))","v":"Poblogaeth 60 oed a throsodd (amcanestyniad)"},{"$f":"IF('iaith - language'!$K$1=2,VLOOKUP(W3,Text!$A$3:$C$353,2,FALSE),VLOOKUP(W3,Text!$A$3:$C$353,3,FALSE))","v":"Poblogaeth 85 oed a throsodd (amcanestyniad)"},{"$f":"IF('iaith - language'!$K$1=2,VLOOKUP(X3,Text!$A$3:$C$353,2,FALSE),VLOOKUP(X3,Text!$A$3:$C$353,3,FALSE))","v":"Poblogaeth oedran gweithio (16-65G/B) (amcanestyniad)"},{"$f":"IF('iaith - language'!$K$1=2,VLOOKUP(Y3,Text!$A$3:$C$353,2,FALSE),VLOOKUP(Y3,Text!$A$3:$C$353,3,FALSE))","v":"Amcangyfrifon Poblogaeth Ganol Blwyddyn, pob oed"},{"$f":"IF('iaith - language'!$K$1=2,VLOOKUP(Z3,Text!$A$3:$C$353,2,FALSE),VLOOKUP(Z3,Text!$A$3:$C$353,3,FALSE))","v":"Amcangyfrifon Poblogaeth Ganol Blwyddyn, 18 oed a throsodd"},{"$f":"IF('iaith - language'!$K$1=2,VLOOKUP(AA3,Text!$A$3:$C$353,2,FALSE),VLOOKUP(AA3,Text!$A$3:$C$353,3,FALSE))","v":"Amcangyfrifon Poblogaeth Ganol Blwyddyn, 65 oed a throsodd"},{"$f":"IF('iaith - language'!$K$1=2,VLOOKUP(AB3,Text!$A$3:$C$353,2,FALSE),VLOOKUP(AB3,Text!$A$3:$C$353,3,FALSE))","v":"Swm a wariwyd ar grantiau cyfleusterau i'r anabl wedi'u cwblhau (£s)"},{"$f":"IF('iaith - language'!$K$1=2,VLOOKUP(AC3,Text!$A$3:$C$353,2,FALSE),VLOOKUP(AC3,Text!$A$3:$C$353,3,FALSE))","v":"Praeseptau Draenio Tir"},{"$f":"IF('iaith - language'!$K$1=2,VLOOKUP(AD3,Text!$A$3:$C$353,2,FALSE),VLOOKUP(AD3,Text!$A$3:$C$353,3,FALSE))","v":"Hyd yr arfordir a warchodir"},{"$f":"IF('iaith - language'!$K$1=2,VLOOKUP(AE3,Text!$A$3:$C$353,2,FALSE),VLOOKUP(AE3,Text!$A$3:$C$353,3,FALSE))","v":"Nifer y Ffermydd"},{"$f":"IF('iaith - language'!$K$1=2,VLOOKUP(AF3,Text!$A$3:$C$353,2,FALSE),VLOOKUP(AF3,Text!$A$3:$C$353,3,FALSE))","v":"Nifer yr Eiddo Masnachu"},{"$f":"IF('iaith - language'!$K$1=2,VLOOKUP(AG3,Text!$A$3:$C$353,2,FALSE),VLOOKUP(AG3,Text!$A$3:$C$353,3,FALSE))","v":"Nifer yr Eiddo Bwyd"},{"$f":"IF('iaith - language'!$K$1=2,VLOOKUP(AH3,Text!$A$3:$C$353,2,FALSE),VLOOKUP(AH3,Text!$A$3:$C$353,3,FALSE))","v":"Cyfanswm yr unedau goleuadau stryd"},{"$f":"IF('iaith - language'!$K$1=2,VLOOKUP(AI3,Text!$A$3:$C$353,2,FALSE),VLOOKUP(AI3,Text!$A$3:$C$353,3,FALSE))","v":"Nifer y marwolaethau wedi'u cofrestru"},{"$f":"IF('iaith - language'!$K$1=2,VLOOKUP(AJ3,Text!$A$3:$C$353,2,FALSE),VLOOKUP(AJ3,Text!$A$3:$C$353,3,FALSE))","v":"Llwyth achosion Cynlluniau Gostyngiadau'r Dreth Gyngor "},{"$f":"IF('iaith - language'!$K$1=2,VLOOKUP(AK3,Text!$A$3:$C$353,2,FALSE),VLOOKUP(AK3,Text!$A$3:$C$353,3,FALSE))","v":"Gwariant Cynlluniau Gostyngiadau'r Dreth Gyngor"},{"$f":"IF('iaith - language'!$K$1=2,VLOOKUP(AL3,Text!$A$3:$C$353,2,FALSE),VLOOKUP(AL3,Text!$A$3:$C$353,3,FALSE))","v":"Cefnogaeth CTRS Covid-19 "},{"$f":"IF('iaith - language'!$K$1=2,VLOOKUP(AM3,Text!$A$3:$C$353,2,FALSE),VLOOKUP(AM3,Text!$A$3:$C$353,3,FALSE))","v":"Nifer y llongau sy'n cyrraedd porthladdoedd"},{"$f":"IF('iaith - language'!$K$1=2,VLOOKUP(AN3,Text!$A$3:$C$353,2,FALSE),VLOOKUP(AN3,Text!$A$3:$C$353,3,FALSE))","v":"Nosweithiau twristiaid (miloedd) gan gynnwys AirBnb"},{"$f":"IF('iaith - language'!$K$1=2,VLOOKUP(AO3,Text!$A$3:$C$353,2,FALSE),VLOOKUP(AO3,Text!$A$3:$C$353,3,FALSE))","v":"Diwrnodau twristiaid (miloedd)"},{"$f":"IF('iaith - language'!$K$1=2,VLOOKUP(AP3,Text!$A$3:$C$353,2,FALSE),VLOOKUP(AP3,Text!$A$3:$C$353,3,FALSE))","v":"Data Hawlwyr Budd-dal "},{"$nulls":10},{"$f":"IF('iaith - language'!$K$1=2,VLOOKUP(BA3,Text!$A$3:$C$353,2,FALSE),VLOOKUP(BA3,Text!$A$3:$C$353,3,FALSE))","v":"Nifer yr Hawlwyr Cymhorthdal Incwm, 18-64 oed"},{"$nulls":3},{"$f":"IF('iaith - language'!$K$1=2,VLOOKUP(BE3,Text!$A$3:$C$353,2,FALSE),VLOOKUP(BE3,Text!$A$3:$C$353,3,FALSE))","v":"Nifer y Derbynwyr Lwfans Ceisio Swydd ar Sail Incwm, 18-64 oed"},{"$nulls":3},{"$f":"IF('iaith - language'!$K$1=2,VLOOKUP(BI3,Text!$A$3:$C$353,2,FALSE),VLOOKUP(BI3,Text!$A$3:$C$353,3,FALSE))","v":"Nifer yr hawlwyr Credyd Pensiwn, 18-64 oed"},{"$nulls":3},{"$f":"IF('iaith - language'!$K$1=2,VLOOKUP(BM3,Text!$A$3:$C$353,2,FALSE),VLOOKUP(BM3,Text!$A$3:$C$353,3,FALSE))","v":"Nifer y rhai sydd yn derbyn Credyd Cynhwysol (ddim mewn cyflogaeth) 18-64 oed"},{"$nulls":3},{"$f":"IF('iaith - language'!$K$1=2,VLOOKUP(BQ3,Text!$A$3:$C$353,2,FALSE),VLOOKUP(BQ3,Text!$A$3:$C$353,3,FALSE))","v":"Cyfanswm yr Hawlwyr Cymhorthdal Incwm"},{"$nulls":3},{"$f":"IF('iaith - language'!$K$1=2,VLOOKUP(BU3,Text!$A$3:$C$353,2,FALSE),VLOOKUP(BU3,Text!$A$3:$C$353,3,FALSE))","v":"Cyfanswm y Derbynwyr Lwfans Ceisio Swydd ar Sail Incwm"},{"$nulls":3},{"$f":"IF('iaith - language'!$K$1=2,VLOOKUP(BY3,Text!$A$3:$C$353,2,FALSE),VLOOKUP(BY3,Text!$A$3:$C$353,3,FALSE))","v":"Cyfanswm Hawlwyr Credyd Pensiwn"},{"$nulls":3},{"$f":"IF('iaith - language'!$K$1=2,VLOOKUP(CC3,Text!$A$3:$C$353,2,FALSE),VLOOKUP(CC3,Text!$A$3:$C$353,3,FALSE))","v":"Cyfanswm y rhai sy’n derbyn Credyd Cynhwysol (ddim mewn cyflogaeth)"},{"$nulls":3},{"$f":"IF('iaith - language'!$K$1=2,VLOOKUP(CG3,Text!$A$3:$C$353,2,FALSE),VLOOKUP(CG3,Text!$A$3:$C$353,3,FALSE))","v":"Nifer yr Hawlwyr Lwfans Anabledd Difrifol, 18-64 oed"},{"$nulls":3},{"$f":"IF('iaith - language'!$K$1=2,VLOOKUP(CK3,Text!$A$3:$C$353,2,FALSE),VLOOKUP(CK3,Text!$A$3:$C$353,3,FALSE))","v":"Nifer yr Hawlwyr Lwfans Byw i'r Anabl, 18-64 oed"},{"$nulls":3},{"$f":"IF('iaith - language'!$K$1=2,VLOOKUP(CO3,Text!$A$3:$C$353,2,FALSE),VLOOKUP(CO3,Text!$A$3:$C$353,3,FALSE))","v":"Nifer yr Hawlwyr Taliad Annibyniaeth Bersonol sydd yn 18-64 oed"},{"$nulls":3},{"$f":"IF('iaith - language'!$K$1=2,VLOOKUP(CS3,Text!$A$3:$C$353,2,FALSE),VLOOKUP(CS3,Text!$A$3:$C$353,3,FALSE))","v":"Hawlwyr Credyd Pensiwn, 65 oed a hŷn "},{"$nulls":3},{"$f":"IF('iaith - language'!$K$1=2,VLOOKUP(CW3,Text!$A$3:$C$353,2,FALSE),VLOOKUP(CW3,Text!$A$3:$C$353,3,FALSE))","v":"Cyfanswn yr hawlwyr Cymhorthdal Incwm, Lwfans Ceisio Gwaith, a Chredyd Pensiwn"},{"$nulls":3},{"$f":"IF('iaith - language'!$K$1=2,VLOOKUP(DA3,Text!$A$3:$C$353,2,FALSE),VLOOKUP(DA3,Text!$A$3:$C$353,3,FALSE))","v":"Stoc eiddo treth cyngor"},{"$f":"IF('iaith - language'!$K$1=2,VLOOKUP(DB3,Text!$A$3:$C$353,2,FALSE),VLOOKUP(DB3,Text!$A$3:$C$353,3,FALSE))","v":"Hyd ffyrdd A y sir (km)"},{"$f":"IF('iaith - language'!$K$1=2,VLOOKUP(DC3,Text!$A$3:$C$353,2,FALSE),VLOOKUP(DC3,Text!$A$3:$C$353,3,FALSE))","v":"Hyd ffyrdd B ac C (km)"},{"$f":"IF('iaith - language'!$K$1=2,VLOOKUP(DD3,Text!$A$3:$C$353,2,FALSE),VLOOKUP(DD3,Text!$A$3:$C$353,3,FALSE))","v":"Hyd is-ffyrdd â wyneb caled (km)"},{"$f":"IF('iaith - language'!$K$1=2,VLOOKUP(DE3,Text!$A$3:$C$353,2,FALSE),VLOOKUP(DE3,Text!$A$3:$C$353,3,FALSE))","v":"Hyd ffyrdd A y sir, adeiledig (km)"},{"$f":"IF('iaith - language'!$K$1=2,VLOOKUP(DF3,Text!$A$3:$C$353,2,FALSE),VLOOKUP(DF3,Text!$A$3:$C$353,3,FALSE))","v":"Hyd ffyrdd B ac C, adeiledig (km)"},{"$f":"IF('iaith - language'!$K$1=2,VLOOKUP(DG3,Text!$A$3:$C$353,2,FALSE),VLOOKUP(DG3,Text!$A$3:$C$353,3,FALSE))","v":"Hyd is-ffyrdd â wyneb caled, adeiledig (km)"}]
[null,0,null,{"$f":"IF('iaith - language'!$K$1=2,VLOOKUP(D$4,Text!$A$3:$C$458,2,FALSE),VLOOKUP(D$4,Text!$A$3:$C$458,3,FALSE))","v":"Mehefin 2021"},{"$f":"IF('iaith - language'!$K$1=2,VLOOKUP(E$4,Text!$A$3:$C$458,2,FALSE),VLOOKUP(E$4,Text!$A$3:$C$458,3,FALSE))","v":"Medi 2021"},{"$f":"IF('iaith - language'!$K$1=2,VLOOKUP(F$4,Text!$A$3:$C$458,2,FALSE),VLOOKUP(F$4,Text!$A$3:$C$458,3,FALSE))","v":"Rhagfyr 2021"},{"$f":"IF('iaith - language'!$K$1=2,VLOOKUP(G$4,Text!$A$3:$C$458,2,FALSE),VLOOKUP(G$4,Text!$A$3:$C$458,3,FALSE))","v":"Mawrth 2022"},"2019-20",{"$f":"IF('iaith - language'!$K$1=2,VLOOKUP(I$4,Text!$A$1:$C$458,2,FALSE),VLOOKUP(I$4,Text!$A$1:$C$458,3,FALSE))","v":"Mai 2022"},"2023","2023",{"$f":"K7","v":"2023"},{"$f":"L7","v":"2023"},"2023","2023","2023","2023","2023","2023","2023","2023","2023","2023","2023","2020","2020","2020","2018-19","2022-23",{"$f":"IF('iaith - language'!$K$1=2,VLOOKUP(AD$4,Text!$A$1:$C$458,2,FALSE),VLOOKUP(AD$4,Text!$A$1:$C$458,3,FALSE))","v":"Mai 2022"},"2021",{"$f":"IF('iaith - language'!$K$1=2,VLOOKUP(AF$4,Text!$A$1:$C$458,2,FALSE),VLOOKUP(AF$4,Text!$A$1:$C$458,3,FALSE))","v":"Mawrth 2022"},{"$f":"IF('iaith - language'!$K$1=2,VLOOKUP(AG$4,Text!$A$1:$C$458,2,FALSE),VLOOKUP(AG$4,Text!$A$1:$C$458,3,FALSE))","v":"Mawrth 2022"},{"$f":"IF('iaith - language'!$K$1=2,VLOOKUP(AH$4,Text!$A$1:$C$458,2,FALSE),VLOOKUP(AH$4,Text!$A$1:$C$458,3,FALSE))","v":"Ebrill 2022"},"2021","2021-22","2021-22","2021-22","2021","2019","2019",{"$f":"IF('iaith - language'!$K$1=2,VLOOKUP(AP$4,Text!$A$1:$C$458,2,FALSE),VLOOKUP(AP$4,Text!$A$1:$C$458,3,FALSE))","v":"Hydref 2021"},{"$f":"IF('iaith - language'!$K$1=2,VLOOKUP(AQ$4,Text!$A$1:$C$458,2,FALSE),VLOOKUP(AQ$4,Text!$A$1:$C$458,3,FALSE))","v":"Tachwedd 2021"},{"$f":"IF('iaith - language'!$K$1=2,VLOOKUP(AR$4,Text!$A$1:$C$458,2,FALSE),VLOOKUP(AR$4,Text!$A$1:$C$458,3,FALSE))","v":"Rhagfyr 2021"},{"$f":"IF('iaith - language'!$K$1=2,VLOOKUP(AS$4,Text!$A$1:$C$458,2,FALSE),VLOOKUP(AS$4,Text!$A$1:$C$458,3,FALSE))","v":"Ionawr 2022"},{"$f":"IF('iaith - language'!$K$1=2,VLOOKUP(AT$4,Text!$A$1:$C$458,2,FALSE),VLOOKUP(AT$4,Text!$A$1:$C$458,3,FALSE))","v":"Chwefror 2022"},{"$f":"IF('iaith - language'!$K$1=2,VLOOKUP(AU$4,Text!$A$1:$C$458,2,FALSE),VLOOKUP(AU$4,Text!$A$1:$C$458,3,FALSE))","v":"Mawrth 2022"},{"$f":"IF('iaith - language'!$K$1=2,VLOOKUP(AV$4,Text!$A$1:$C$458,2,FALSE),VLOOKUP(AV$4,Text!$A$1:$C$458,3,FALSE))","v":"Ebrill 2022"},{"$f":"IF('iaith - language'!$K$1=2,VLOOKUP(AW$4,Text!$A$1:$C$458,2,FALSE),VLOOKUP(AW$4,Text!$A$1:$C$458,3,FALSE))","v":"Mai 2022"},{"$f":"IF('iaith - language'!$K$1=2,VLOOKUP(AX$4,Text!$A$1:$C$458,2,FALSE),VLOOKUP(AX$4,Text!$A$1:$C$458,3,FALSE))","v":"Mehefin 2022"},{"$f":"IF('iaith - language'!$K$1=2,VLOOKUP(AY$4,Text!$A$1:$C$458,2,FALSE),VLOOKUP(AY$4,Text!$A$1:$C$458,3,FALSE))","v":"Gorffennaf 2022"},{"$f":"IF('iaith - language'!$K$1=2,VLOOKUP(AZ$4,Text!$A$1:$C$458,2,FALSE),VLOOKUP(AZ$4,Text!$A$1:$C$458,3,FALSE))","v":"Awst 2022"},{"$f":"IF('iaith - language'!$K$1=2,VLOOKUP(BA$4,Text!$A$1:$C$458,2,FALSE),VLOOKUP(BA$4,Text!$A$1:$C$458,3,FALSE))","v":"Mai 2021"},{"$f":"IF('iaith - language'!$K$1=2,VLOOKUP(BB$4,Text!$A$1:$C$458,2,FALSE),VLOOKUP(BB$4,Text!$A$1:$C$458,3,FALSE))","v":"Awst 2021"},{"$f":"IF('iaith - language'!$K$1=2,VLOOKUP(BC$4,Text!$A$1:$C$458,2,FALSE),VLOOKUP(BC$4,Text!$A$1:$C$458,3,FALSE))","v":"Tachwedd 2021"},{"$f":"IF('iaith - language'!$K$1=2,VLOOKUP(BD$4,Text!$A$1:$C$458,2,FALSE),VLOOKUP(BD$4,Text!$A$1:$C$458,3,FALSE))","v":"Chwefror 2022"},{"$f":"IF('iaith - language'!$K$1=2,VLOOKUP(BE$4,Text!$A$1:$C$458,2,FALSE),VLOOKUP(BE$4,Text!$A$1:$C$458,3,FALSE))","v":"Mai 2021"},{"$f":"IF('iaith - language'!$K$1=2,VLOOKUP(BF$4,Text!$A$1:$C$458,2,FALSE),VLOOKUP(BF$4,Text!$A$1:$C$458,3,FALSE))","v":"Awst 2021"},{"$f":"IF('iaith - language'!$K$1=2,VLOOKUP(BG$4,Text!$A$1:$C$458,2,FALSE),VLOOKUP(BG$4,Text!$A$1:$C$458,3,FALSE))","v":"Tachwedd 2021"},{"$f":"IF('iaith - language'!$K$1=2,VLOOKUP(BH$4,Text!$A$1:$C$458,2,FALSE),VLOOKUP(BH$4,Text!$A$1:$C$458,3,FALSE))","v":"Chwefror 2022"},{"$f":"IF('iaith - language'!$K$1=2,VLOOKUP(BI$4,Text!$A$1:$C$458,2,FALSE),VLOOKUP(BI$4,Text!$A$1:$C$458,3,FALSE))","v":"Mai 2021"},{"$f":"IF('iaith - language'!$K$1=2,VLOOKUP(BJ$4,Text!$A$1:$C$458,2,FALSE),VLOOKUP(BJ$4,Text!$A$1:$C$458,3,FALSE))","v":"Awst 2021"},{"$f":"IF('iaith - language'!$K$1=2,VLOOKUP(BK$4,Text!$A$1:$C$458,2,FALSE),VLOOKUP(BK$4,Text!$A$1:$C$458,3,FALSE))","v":"Tachwedd 2021"},{"$f":"IF('iaith - language'!$K$1=2,VLOOKUP(BL$4,Text!$A$1:$C$458,2,FALSE),VLOOKUP(BL$4,Text!$A$1:$C$458,3,FALSE))","v":"Chwefror 2022"},{"$f":"IF('iaith - language'!$K$1=2,VLOOKUP(BM$4,Text!$A$1:$C$458,2,FALSE),VLOOKUP(BM$4,Text!$A$1:$C$458,3,FALSE))","v":"Mai 2021"},{"$f":"IF('iaith - language'!$K$1=2,VLOOKUP(BN$4,Text!$A$1:$C$458,2,FALSE),VLOOKUP(BN$4,Text!$A$1:$C$458,3,FALSE))","v":"Awst 2021"},{"$f":"IF('iaith - language'!$K$1=2,VLOOKUP(BO$4,Text!$A$1:$C$458,2,FALSE),VLOOKUP(BO$4,Text!$A$1:$C$458,3,FALSE))","v":"Tachwedd 2021"},{"$f":"IF('iaith - language'!$K$1=2,VLOOKUP(BP$4,Text!$A$1:$C$458,2,FALSE),VLOOKUP(BP$4,Text!$A$1:$C$458,3,FALSE))","v":"Chwefror 2022"},{"$f":"IF('iaith - language'!$K$1=2,VLOOKUP(BQ$4,Text!$A$1:$C$458,2,FALSE),VLOOKUP(BQ$4,Text!$A$1:$C$458,3,FALSE))","v":"Mai 2021"},{"$f":"IF('iaith - language'!$K$1=2,VLOOKUP(BR$4,Text!$A$1:$C$458,2,FALSE),VLOOKUP(BR$4,Text!$A$1:$C$458,3,FALSE))","v":"Awst 2021"},{"$f":"IF('iaith - language'!$K$1=2,VLOOKUP(BS$4,Text!$A$1:$C$458,2,FALSE),VLOOKUP(BS$4,Text!$A$1:$C$458,3,FALSE))","v":"Tachwedd 2021"},{"$f":"IF('iaith - language'!$K$1=2,VLOOKUP(BT$4,Text!$A$1:$C$458,2,FALSE),VLOOKUP(BT$4,Text!$A$1:$C$458,3,FALSE))","v":"Chwefror 2022"},{"$f":"IF('iaith - language'!$K$1=2,VLOOKUP(BU$4,Text!$A$1:$C$458,2,FALSE),VLOOKUP(BU$4,Text!$A$1:$C$458,3,FALSE))","v":"Mai 2021"},{"$f":"IF('iaith - language'!$K$1=2,VLOOKUP(BV$4,Text!$A$1:$C$458,2,FALSE),VLOOKUP(BV$4,Text!$A$1:$C$458,3,FALSE))","v":"Awst 2021"},{"$f":"IF('iaith - language'!$K$1=2,VLOOKUP(BW$4,Text!$A$1:$C$458,2,FALSE),VLOOKUP(BW$4,Text!$A$1:$C$458,3,FALSE))","v":"Tachwedd 2021"},{"$f":"IF('iaith - language'!$K$1=2,VLOOKUP(BX$4,Text!$A$1:$C$458,2,FALSE),VLOOKUP(BX$4,Text!$A$1:$C$458,3,FALSE))","v":"Chwefror 2022"},{"$f":"IF('iaith - language'!$K$1=2,VLOOKUP(BY$4,Text!$A$1:$C$458,2,FALSE),VLOOKUP(BY$4,Text!$A$1:$C$458,3,FALSE))","v":"Mai 2021"},{"$f":"IF('iaith - language'!$K$1=2,VLOOKUP(BZ$4,Text!$A$1:$C$458,2,FALSE),VLOOKUP(BZ$4,Text!$A$1:$C$458,3,FALSE))","v":"Awst 2021"},{"$f":"IF('iaith - language'!$K$1=2,VLOOKUP(CA$4,Text!$A$1:$C$458,2,FALSE),VLOOKUP(CA$4,Text!$A$1:$C$458,3,FALSE))","v":"Tachwedd 2021"},{"$f":"IF('iaith - language'!$K$1=2,VLOOKUP(CB$4,Text!$A$1:$C$458,2,FALSE),VLOOKUP(CB$4,Text!$A$1:$C$458,3,FALSE))","v":"Chwefror 2022"},{"$f":"IF('iaith - language'!$K$1=2,VLOOKUP(CC$4,Text!$A$1:$C$458,2,FALSE),VLOOKUP(CC$4,Text!$A$1:$C$458,3,FALSE))","v":"Mai 2021"},{"$f":"IF('iaith - language'!$K$1=2,VLOOKUP(CD$4,Text!$A$1:$C$458,2,FALSE),VLOOKUP(CD$4,Text!$A$1:$C$458,3,FALSE))","v":"Awst 2021"},{"$f":"IF('iaith - language'!$K$1=2,VLOOKUP(CE$4,Text!$A$1:$C$458,2,FALSE),VLOOKUP(CE$4,Text!$A$1:$C$458,3,FALSE))","v":"Tachwedd 2021"},{"$f":"IF('iaith - language'!$K$1=2,VLOOKUP(CF$4,Text!$A$1:$C$458,2,FALSE),VLOOKUP(CF$4,Text!$A$1:$C$458,3,FALSE))","v":"Chwefror 2022"},{"$f":"IF('iaith - language'!$K$1=2,VLOOKUP(CG$4,Text!$A$1:$C$458,2,FALSE),VLOOKUP(CG$4,Text!$A$1:$C$458,3,FALSE))","v":"Mai 2021"},{"$f":"IF('iaith - language'!$K$1=2,VLOOKUP(CH$4,Text!$A$1:$C$458,2,FALSE),VLOOKUP(CH$4,Text!$A$1:$C$458,3,FALSE))","v":"Awst 2021"},{"$f":"IF('iaith - language'!$K$1=2,VLOOKUP(CI$4,Text!$A$1:$C$458,2,FALSE),VLOOKUP(CI$4,Text!$A$1:$C$458,3,FALSE))","v":"Tachwedd 2021"},{"$f":"IF('iaith - language'!$K$1=2,VLOOKUP(CJ$4,Text!$A$1:$C$458,2,FALSE),VLOOKUP(CJ$4,Text!$A$1:$C$458,3,FALSE))","v":"Chwefror 2022"},{"$f":"IF('iaith - language'!$K$1=2,VLOOKUP(CK$4,Text!$A$1:$C$458,2,FALSE),VLOOKUP(CK$4,Text!$A$1:$C$458,3,FALSE))","v":"Mai 2021"},{"$f":"IF('iaith - language'!$K$1=2,VLOOKUP(CL$4,Text!$A$1:$C$458,2,FALSE),VLOOKUP(CL$4,Text!$A$1:$C$458,3,FALSE))","v":"Awst 2021"},{"$f":"IF('iaith - language'!$K$1=2,VLOOKUP(CM$4,Text!$A$1:$C$458,2,FALSE),VLOOKUP(CM$4,Text!$A$1:$C$458,3,FALSE))","v":"Tachwedd 2021"},{"$f":"IF('iaith - language'!$K$1=2,VLOOKUP(CN$4,Text!$A$1:$C$458,2,FALSE),VLOOKUP(CN$4,Text!$A$1:$C$458,3,FALSE))","v":"Chwefror 2022"},{"$f":"IF('iaith - language'!$K$1=2,VLOOKUP(CO$4,Text!$A$1:$C$458,2,FALSE),VLOOKUP(CO$4,Text!$A$1:$C$458,3,FALSE))","v":"Mai 2021"},{"$f":"IF('iaith - language'!$K$1=2,VLOOKUP(CP$4,Text!$A$1:$C$458,2,FALSE),VLOOKUP(CP$4,Text!$A$1:$C$458,3,FALSE))","v":"Awst 2021"},{"$f":"IF('iaith - language'!$K$1=2,VLOOKUP(CQ$4,Text!$A$1:$C$458,2,FALSE),VLOOKUP(CQ$4,Text!$A$1:$C$458,3,FALSE))","v":"Tachwedd 2021"},{"$f":"IF('iaith - language'!$K$1=2,VLOOKUP(CR$4,Text!$A$1:$C$458,2,FALSE),VLOOKUP(CR$4,Text!$A$1:$C$458,3,FALSE))","v":"Chwefror 2022"},{"$f":"IF('iaith - language'!$K$1=2,VLOOKUP(CS$4,Text!$A$1:$C$458,2,FALSE),VLOOKUP(CS$4,Text!$A$1:$C$458,3,FALSE))","v":"Mai 2021"},{"$f":"IF('iaith - language'!$K$1=2,VLOOKUP(CT$4,Text!$A$1:$C$458,2,FALSE),VLOOKUP(CT$4,Text!$A$1:$C$458,3,FALSE))","v":"Awst 2021"},{"$f":"IF('iaith - language'!$K$1=2,VLOOKUP(CU$4,Text!$A$1:$C$458,2,FALSE),VLOOKUP(CU$4,Text!$A$1:$C$458,3,FALSE))","v":"Tachwedd 2021"},{"$f":"IF('iaith - language'!$K$1=2,VLOOKUP(CV$4,Text!$A$1:$C$458,2,FALSE),VLOOKUP(CV$4,Text!$A$1:$C$458,3,FALSE))","v":"Chwefror 2022"},{"$f":"IF('iaith - language'!$K$1=2,VLOOKUP(CW$4,Text!$A$1:$C$458,2,FALSE),VLOOKUP(CW$4,Text!$A$1:$C$458,3,FALSE))","v":"Mai 2021"},{"$f":"IF('iaith - language'!$K$1=2,VLOOKUP(CX$4,Text!$A$1:$C$458,2,FALSE),VLOOKUP(CX$4,Text!$A$1:$C$458,3,FALSE))","v":"Awst 2021"},{"$f":"IF('iaith - language'!$K$1=2,VLOOKUP(CY$4,Text!$A$1:$C$458,2,FALSE),VLOOKUP(CY$4,Text!$A$1:$C$458,3,FALSE))","v":"Tachwedd 2021"},{"$f":"IF('iaith - language'!$K$1=2,VLOOKUP(CZ$4,Text!$A$1:$C$458,2,FALSE),VLOOKUP(CZ$4,Text!$A$1:$C$458,3,FALSE))","v":"Chwefror 2022"},{"$f":"IF('iaith - language'!$K$1=2,VLOOKUP(DA$4,Text!$A$1:$C$458,2,FALSE),VLOOKUP(DA$4,Text!$A$1:$C$458,3,FALSE))","v":"Mawrth 2022"},{"$f":"IF('iaith - language'!$K$1=2,VLOOKUP(DB$4,Text!$A$1:$C$458,2,FALSE),VLOOKUP(DB$4,Text!$A$1:$C$458,3,FALSE))","v":"Mawrth 2022"},{"$f":"IF('iaith - language'!$K$1=2,VLOOKUP(DC$4,Text!$A$1:$C$458,2,FALSE),VLOOKUP(DC$4,Text!$A$1:$C$458,3,FALSE))","v":"Mawrth 2022"},{"$f":"IF('iaith - language'!$K$1=2,VLOOKUP(DD$4,Text!$A$1:$C$458,2,FALSE),VLOOKUP(DD$4,Text!$A$1:$C$458,3,FALSE))","v":"Mawrth 2022"},{"$f":"IF('iaith - language'!$K$1=2,VLOOKUP(DE$4,Text!$A$1:$C$458,2,FALSE),VLOOKUP(DE$4,Text!$A$1:$C$458,3,FALSE))","v":"Mawrth 2022"},{"$f":"IF('iaith - language'!$K$1=2,VLOOKUP(DF$4,Text!$A$1:$C$458,2,FALSE),VLOOKUP(DF$4,Text!$A$1:$C$458,3,FALSE))","v":"Mawrth 2022"},{"$f":"IF('iaith - language'!$K$1=2,VLOOKUP(DG$4,Text!$A$1:$C$458,2,FALSE),VLOOKUP(DG$4,Text!$A$1:$C$458,3,FALSE))","v":"Mawrth 2022"}]
[]
[117,2,{"$f":"IF('iaith - language'!$K$1=2,VLOOKUP(A9,Text!$A$3:$C$353,2,FALSE),VLOOKUP(A9,Text!$A$3:$C$353,3,FALSE))","v":"Sir Ynys Môn"},200,240,228,"N/A","N/A",{"v":71523.74,"d":"71,524"},{"v":69841.501005,"d":"69,842"},{"v":707.707666,"d":"708"},{"v":6725.620739000001,"d":"6,726"},{"v":10721.435633000001,"d":"10,721"},{"v":4052.2980740000003,"d":"4,052"},{"v":7202.189885000001,"d":"7,202"},{"v":57855.612657000005,"d":"57,856"},{"v":2155.155319,"d":"2,155"},{"v":13490.483983999999,"d":"13,490"},{"v":37430.681448999996,"d":"37,431"},{"v":56351.017024000015,"d":"56,351"},{"v":45486.79176499999,"d":"45,487"},{"v":24354.709242999998,"d":"24,355"},{"v":2365.558295,"d":"2,366"},{"v":39959.59234599999,"d":"39,960"},{"v":70440,"d":"70,440"},{"v":57101,"d":"57,101"},{"v":18639,"d":"18,639"},null,{"v":3966,"d":"3,966"},7.9,907,{"v":3430,"d":"3,430"},{"v":1030,"d":"1,030"},{"v":10019,"d":"10,019"},910,{"v":5744,"d":"5,744"},{"v":6293928.05,"d":"6,293,928"},"N/A",{"v":2891,"d":"2,891"},{"v":5514.022396125236,"d":"5,514"},{"v":707.4918435630126,"d":"707"},{"v":1700,"d":"1,700"},{"v":1655,"d":"1,655"},{"v":1640,"d":"1,640"},{"v":1595,"d":"1,595"},{"v":1580,"d":"1,580"},{"v":1550,"d":"1,550"},{"v":1480,"d":"1,480"},{"v":1380,"d":"1,380"},{"v":1305,"d":"1,305"},{"v":1275,"d":"1,275"},{"v":1265,"d":"1,265"},292,277,252,235,235,206,184,182,0,0,0,0,{"v":3185,"d":"3,185"},{"v":2986,"d":"2,986"},{"v":2932,"d":"2,932"},{"v":2996,"d":"2,996"},298,279,259,243,246,212,188,188,{"v":2223,"d":"2,223"},{"v":2191,"d":"2,191"},{"v":2165,"d":"2,165"},{"v":2132,"d":"2,132"},{"v":3279,"d":"3,279"},{"v":3078,"d":"3,078"},{"v":3033,"d":"3,033"},{"v":3093,"d":"3,093"},0,0,0,0,75,72,75,74,{"v":2749,"d":"2,749"},{"v":2786,"d":"2,786"},{"v":2842,"d":"2,842"},{"v":2908,"d":"2,908"},{"v":2223,"d":"2,223"},{"v":2191,"d":"2,191"},{"v":2165,"d":"2,165"},{"v":2132,"d":"2,132"},{"v":2767,"d":"2,767"},{"v":2682,"d":"2,682"},{"v":2612,"d":"2,612"},{"v":2563,"d":"2,563"},{"v":35380,"d":"35,380"},{"v":145.5,"d":"145.50"},{"v":484.4,"d":"484.40"},{"v":558.5,"d":"558.50"},{"v":28.1,"d":"28.10"},{"v":59.599999999999994,"d":"59.60"},{"v":180.9,"d":"180.90"}]
[118,3,{"$f":"IF('iaith - language'!$K$1=2,VLOOKUP(A10,Text!$A$3:$C$353,2,FALSE),VLOOKUP(A10,Text!$A$3:$C$353,3,FALSE))","v":"Gwynedd"},266,377,270,"N/A","N/A",{"v":254829.206,"d":"254,829"},{"v":125539.055315,"d":"125,539"},{"v":1223.025991,"d":"1,223"},{"v":11518.327215,"d":"11,518"},{"v":18638.486754999998,"d":"18,638"},{"v":7147.769282000001,"d":"7,148"},{"v":15965.208525000002,"d":"15,965"},{"v":104686.328307,"d":"104,686"},{"v":4360.460358,"d":"4,360"},{"v":23748.736455000002,"d":"23,749"},{"v":72697.07376699998,"d":"72,697"},{"v":101790.31886499995,"d":"101,790"},{"v":87997.796688,"d":"87,998"},{"v":37541.25863200001,"d":"37,541"},{"v":4066.4066869999997,"d":"4,066"},{"v":77235.49058799999,"d":"77,235"},{"v":125171,"d":"125,171"},{"v":101957,"d":"101,957"},{"v":28562,"d":"28,562"},null,{"v":121122,"d":"121,122"},{"v":20.137,"d":"20.1"},{"v":1775,"d":"1,775"},{"v":8470,"d":"8,470"},{"v":2520,"d":"2,520"},{"v":17962,"d":"17,962"},{"v":1368,"d":"1,368"},{"v":8688,"d":"8,688"},{"v":9889622.07,"d":"9,889,622"},"N/A",3,{"v":20095.71004285075,"d":"20,096"},{"v":3836.383671608743,"d":"3,836"},{"v":2535,"d":"2,535"},{"v":2510,"d":"2,510"},{"v":2505,"d":"2,505"},{"v":2555,"d":"2,555"},{"v":2570,"d":"2,570"},{"v":2420,"d":"2,420"},{"v":2135,"d":"2,135"},{"v":1975,"d":"1,975"},{"v":1890,"d":"1,890"},{"v":1885,"d":"1,885"},{"v":1945,"d":"1,945"},381,354,322,296,261,192,178,162,0,0,0,0,{"v":5165,"d":"5,165"},{"v":4672,"d":"4,672"},{"v":4613,"d":"4,613"},{"v":4815,"d":"4,815"},388,355,330,302,270,202,186,171,{"v":3701,"d":"3,701"},{"v":3649,"d":"3,649"},{"v":3573,"d":"3,573"},{"v":3539,"d":"3,539"},{"v":5290,"d":"5,290"},{"v":4795,"d":"4,795"},{"v":4733,"d":"4,733"},{"v":4943,"d":"4,943"},0,0,0,0,115,115,111,113,{"v":3908,"d":"3,908"},{"v":3955,"d":"3,955"},{"v":4015,"d":"4,015"},{"v":4119,"d":"4,119"},{"v":3701,"d":"3,701"},{"v":3649,"d":"3,649"},{"v":3573,"d":"3,573"},{"v":3539,"d":"3,539"},{"v":4359,"d":"4,359"},{"v":4206,"d":"4,206"},{"v":4089,"d":"4,089"},{"v":4012,"d":"4,012"},{"v":61330,"d":"61,330"},{"v":330.5,"d":"330.50"},{"v":1064.9,"d":"1,064.90"},{"v":1322.2,"d":"1,322.20"},{"v":71.5,"d":"71.50"},{"v":104.30000000000001,"d":"104.30"},{"v":346.9,"d":"346.90"}]
[119,4,{"$f":"IF('iaith - language'!$K$1=2,VLOOKUP(A11,Text!$A$3:$C$353,2,FALSE),VLOOKUP(A11,Text!$A$3:$C$353,3,FALSE))","v":"Conwy"},231,295,256,"N/A","N/A",{"v":113018.018,"d":"113,018"},{"v":118624.717592,"d":"118,625"},{"v":1083.882588,"d":"1,084"},{"v":10677.725604,"d":"10,678"},{"v":17329.930049,"d":"17,330"},{"v":6698.0459470000005,"d":"6,698"},{"v":12068.452741,"d":"12,068"},{"v":99493.06407299999,"d":"99,493"},{"v":3813.571542,"d":"3,814"},{"v":21745.188777,"d":"21,745"},{"v":62661.656830999986,"d":"62,662"},{"v":96879.52881499998,"d":"96,880"},{"v":75100.55430000002,"d":"75,101"},{"v":43524.163292,"d":"43,524"},{"v":5235.884975,"d":"5,236"},{"v":67032.230671,"d":"67,032"},{"v":118184,"d":"118,184"},{"v":97000,"d":"97,000"},{"v":32938,"d":"32,938"},null,{"v":42032,"d":"42,032"},{"v":23.59,"d":"23.6"},902,{"v":5420,"d":"5,420"},{"v":2210,"d":"2,210"},{"v":16723,"d":"16,723"},{"v":1625,"d":"1,625"},{"v":9892,"d":"9,892"},{"v":11100717,"d":"11,100,717"},"N/A",45,{"v":11135.436688486161,"d":"11,135"},{"v":7219.659429750646,"d":"7,220"},{"v":2980,"d":"2,980"},{"v":2930,"d":"2,930"},{"v":2915,"d":"2,915"},{"v":2900,"d":"2,900"},{"v":2895,"d":"2,895"},{"v":2740,"d":"2,740"},{"v":2455,"d":"2,455"},{"v":2335,"d":"2,335"},{"v":2240,"d":"2,240"},{"v":2245,"d":"2,245"},{"v":2265,"d":"2,265"},482,442,407,379,334,235,206,210,0,0,0,0,{"v":6025,"d":"6,025"},{"v":5516,"d":"5,516"},{"v":5347,"d":"5,347"},{"v":5480,"d":"5,480"},481,452,417,389,344,246,218,216,{"v":3901,"d":"3,901"},{"v":3825,"d":"3,825"},{"v":3793,"d":"3,793"},{"v":3728,"d":"3,728"},{"v":6169,"d":"6,169"},{"v":5667,"d":"5,667"},{"v":5491,"d":"5,491"},{"v":5625,"d":"5,625"},0,0,0,0,136,137,135,129,{"v":5090,"d":"5,090"},{"v":5137,"d":"5,137"},{"v":5193,"d":"5,193"},{"v":5329,"d":"5,329"},{"v":3901,"d":"3,901"},{"v":3825,"d":"3,825"},{"v":3793,"d":"3,793"},{"v":3728,"d":"3,728"},{"v":4726,"d":"4,726"},{"v":4523,"d":"4,523"},{"v":4428,"d":"4,428"},{"v":4333,"d":"4,333"},{"v":57850,"d":"57,850"},{"v":117.5,"d":"117.50"},{"v":663.6,"d":"663.60"},{"v":897.2,"d":"897.20"},{"v":51.6,"d":"51.60"},{"v":102.8,"d":"102.80"},{"v":419.6,"d":"419.60"}]
[120,5,{"$f":"IF('iaith - language'!$K$1=2,VLOOKUP(A12,Text!$A$3:$C$353,2,FALSE),VLOOKUP(A12,Text!$A$3:$C$353,3,FALSE))","v":"Sir Ddinbych"},241,232,218,"N/A","N/A",{"v":83871.49,"d":"83,871"},{"v":96198.289318,"d":"96,198"},{"v":971.498252,"d":"971"},{"v":9595.724134,"d":"9,596"},{"v":15658.552435000001,"d":"15,659"},{"v":6052.1871360000005,"d":"6,052"},{"v":10895.677192000001,"d":"10,896"},{"v":78896.315339,"d":"78,896"},{"v":3380.4620000000004,"d":"3,380"},{"v":19625.332658000003,"d":"19,625"},{"v":52263.36735999998,"d":"52,263"},{"v":76572.95666099999,"d":"76,573"},{"v":64678.07114800001,"d":"64,678"},{"v":31520.218171000004,"d":"31,520"},{"v":2845.2484349999995,"d":"2,845"},{"v":55891.637541,"d":"55,892"},{"v":96664,"d":"96,664"},{"v":77165,"d":"77,165"},{"v":23517,"d":"23,517"},null,0,9.4,740,{"v":4000,"d":"4,000"},{"v":1630,"d":"1,630"},{"v":11690,"d":"11,690"},{"v":1341,"d":"1,341"},{"v":8992,"d":"8,992"},{"v":10569301,"d":"10,569,301"},"N/A",0,{"v":7466.735467847676,"d":"7,467"},{"v":4400.806284565748,"d":"4,401"},{"v":2570,"d":"2,570"},{"v":2545,"d":"2,545"},{"v":2450,"d":"2,450"},{"v":2430,"d":"2,430"},{"v":2365,"d":"2,365"},{"v":2245,"d":"2,245"},{"v":2065,"d":"2,065"},{"v":1965,"d":"1,965"},{"v":1940,"d":"1,940"},{"v":1915,"d":"1,915"},{"v":1980,"d":"1,980"},487,450,426,407,197,170,154,151,0,0,0,0,{"v":5603,"d":"5,603"},{"v":5213,"d":"5,213"},{"v":5185,"d":"5,185"},{"v":5277,"d":"5,277"},495,456,434,411,202,171,162,160,{"v":3383,"d":"3,383"},{"v":3338,"d":"3,338"},{"v":3264,"d":"3,264"},{"v":3220,"d":"3,220"},{"v":5760,"d":"5,760"},{"v":5369,"d":"5,369"},{"v":5341,"d":"5,341"},{"v":5439,"d":"5,439"},0,0,0,0,155,156,148,142,{"v":5130,"d":"5,130"},{"v":5239,"d":"5,239"},{"v":5321,"d":"5,321"},{"v":5445,"d":"5,445"},{"v":3383,"d":"3,383"},{"v":3338,"d":"3,338"},{"v":3264,"d":"3,264"},{"v":3220,"d":"3,220"},{"v":4080,"d":"4,080"},{"v":3965,"d":"3,965"},{"v":3860,"d":"3,860"},{"v":3791,"d":"3,791"},{"v":45820,"d":"45,820"},{"v":139.8,"d":"139.80"},{"v":655.3,"d":"655.30"},{"v":623.4,"d":"623.40"},{"v":29.7,"d":"29.70"},{"v":49.9,"d":"49.90"},{"v":222.2,"d":"222.20"}]
[121,6,{"$f":"IF('iaith - language'!$K$1=2,VLOOKUP(A13,Text!$A$3:$C$353,2,FALSE),VLOOKUP(A13,Text!$A$3:$C$353,3,FALSE))","v":"Sir y Fflint"},297,293,265,"N/A","N/A",{"v":43983.081000000006,"d":"43,983"},{"v":157626.089563,"d":"157,626"},{"v":1685.313246,"d":"1,685"},{"v":16033.553672,"d":"16,034"},{"v":26094.737327,"d":"26,095"},{"v":10010.081169,"d":"10,010"},{"v":18209.001202,"d":"18,209"},{"v":128687.747112,"d":"128,688"},{"v":5635.822782,"d":"5,636"},{"v":32776.2388,"d":"32,776"},{"v":90353.178884,"d":"90,353"},{"v":124849.85077000002,"d":"124,850"},{"v":112512.02535599997,"d":"112,512"},{"v":45114.06421399999,"d":"45,114"},{"v":4156.126748,"d":"4,156"},{"v":96060.65060399998,"d":"96,061"},{"v":156847,"d":"156,847"},{"v":124648,"d":"124,648"},{"v":33294,"d":"33,294"},null,0,{"v":2.76,"d":"2.8"},509,{"v":5200,"d":"5,200"},{"v":1670,"d":"1,670"},{"v":20432,"d":"20,432"},{"v":1646,"d":"1,646"},{"v":10473,"d":"10,473"},{"v":11599458,"d":"11,599,458"},"N/A",4,{"v":3924.1983287717267,"d":"3,924"},{"v":2929.6085719648577,"d":"2,930"},{"v":3610,"d":"3,610"},{"v":3475,"d":"3,475"},{"v":3380,"d":"3,380"},{"v":3365,"d":"3,365"},{"v":3395,"d":"3,395"},{"v":3240,"d":"3,240"},{"v":3015,"d":"3,015"},{"v":2905,"d":"2,905"},{"v":2775,"d":"2,775"},{"v":2700,"d":"2,700"},{"v":2735,"d":"2,735"},411,382,365,346,313,242,205,182,0,0,0,0,{"v":7735,"d":"7,735"},{"v":7374,"d":"7,374"},{"v":7167,"d":"7,167"},{"v":7199,"d":"7,199"},417,388,370,353,320,252,209,190,{"v":3707,"d":"3,707"},{"v":3660,"d":"3,660"},{"v":3600,"d":"3,600"},{"v":3558,"d":"3,558"},{"v":7913,"d":"7,913"},{"v":7555,"d":"7,555"},{"v":7345,"d":"7,345"},{"v":7386,"d":"7,386"},0,0,0,0,117,116,117,116,{"v":6181,"d":"6,181"},{"v":6267,"d":"6,267"},{"v":6354,"d":"6,354"},{"v":6502,"d":"6,502"},{"v":3707,"d":"3,707"},{"v":3660,"d":"3,660"},{"v":3600,"d":"3,600"},{"v":3558,"d":"3,558"},{"v":4444,"d":"4,444"},{"v":4300,"d":"4,300"},{"v":4179,"d":"4,179"},{"v":4101,"d":"4,101"},{"v":70650,"d":"70,650"},{"v":152,"d":"152.00"},{"v":340.5,"d":"340.50"},{"v":687.5,"d":"687.50"},{"v":64.1,"d":"64.10"},{"v":111.2,"d":"111.20"},{"v":432.8,"d":"432.80"}]
[122,7,{"$f":"IF('iaith - language'!$K$1=2,VLOOKUP(A14,Text!$A$3:$C$353,2,FALSE),VLOOKUP(A14,Text!$A$3:$C$353,3,FALSE))","v":"Wrecsam"},301,265,245,"N/A","N/A",{"v":50377.227,"d":"50,377"},{"v":136418.706375,"d":"136,419"},{"v":1514.702801,"d":"1,515"},{"v":14262.122252000001,"d":"14,262"},{"v":23003.809950000003,"d":"23,004"},{"v":8730.328424,"d":"8,730"},{"v":16162.526783535943,"d":"16,163"},{"v":110833.19584929476,"d":"110,833"},{"v":4951.112534,"d":"4,951"},{"v":29041.653788887616,"d":"29,042"},{"v":78821.11873793001,"d":"78,821"},{"v":107377.05259311241,"d":"107,377"},{"v":99165.09541181766,"d":"99,165"},{"v":37253.61097018237,"d":"37,254"},{"v":3520.0380250000003,"d":"3,520"},{"v":83826.29538993005,"d":"83,826"},{"v":136055,"d":"136,055"},{"v":107142,"d":"107,142"},{"v":27749,"d":"27,749"},null,0,{"v":0,"d":"0.0"},458,{"v":4080,"d":"4,080"},{"v":1420,"d":"1,420"},{"v":13255,"d":"13,255"},{"v":1629,"d":"1,629"},{"v":11097,"d":"11,097"},{"v":11641100,"d":"11,641,100"},"N/A",0,{"v":1197.97669333984,"d":"1,198"},{"v":1544.2190134067457,"d":"1,544"},{"v":3525,"d":"3,525"},{"v":3415,"d":"3,415"},{"v":3290,"d":"3,290"},{"v":3240,"d":"3,240"},{"v":3160,"d":"3,160"},{"v":3000,"d":"3,000"},{"v":2755,"d":"2,755"},{"v":2665,"d":"2,665"},{"v":2600,"d":"2,600"},{"v":2525,"d":"2,525"},{"v":2635,"d":"2,635"},539,498,468,444,239,184,129,139,0,0,0,0,{"v":7850,"d":"7,850"},{"v":7470,"d":"7,470"},{"v":7213,"d":"7,213"},{"v":7092,"d":"7,092"},546,511,478,454,245,190,131,140,{"v":3499,"d":"3,499"},{"v":3466,"d":"3,466"},{"v":3426,"d":"3,426"},{"v":3370,"d":"3,370"},{"v":8056,"d":"8,056"},{"v":7676,"d":"7,676"},{"v":7419,"d":"7,419"},{"v":7284,"d":"7,284"},0,0,0,0,165,168,164,163,{"v":6107,"d":"6,107"},{"v":6199,"d":"6,199"},{"v":6341,"d":"6,341"},{"v":6491,"d":"6,491"},{"v":3499,"d":"3,499"},{"v":3466,"d":"3,466"},{"v":3426,"d":"3,426"},{"v":3370,"d":"3,370"},{"v":4290,"d":"4,290"},{"v":4167,"d":"4,167"},{"v":4035,"d":"4,035"},{"v":3964,"d":"3,964"},{"v":61140,"d":"61,140"},{"v":110,"d":"110.00"},{"v":513,"d":"513.00"},{"v":520.1,"d":"520.10"},{"v":30.7,"d":"30.70"},{"v":126.4,"d":"126.40"},{"v":298.4,"d":"298.40"}]
[123,8,{"$f":"IF('iaith - language'!$K$1=2,VLOOKUP(A15,Text!$A$3:$C$353,2,FALSE),VLOOKUP(A15,Text!$A$3:$C$353,3,FALSE))","v":"Powys"},421,401,364,"N/A","N/A",{"v":519531.095,"d":"519,531"},{"v":132596.664155,"d":"132,597"},{"v":1229.389659,"d":"1,229"},{"v":11595.418066,"d":"11,595"},{"v":19049.396416,"d":"19,049"},{"v":7320.392605,"d":"7,320"},{"v":13314.905837,"d":"13,315"},{"v":111508.896267,"d":"111,509"},{"v":4300.113774,"d":"4,300"},{"v":24004.122789,"d":"24,004"},{"v":70565.33748099997,"d":"70,565"},{"v":108592.54137500002,"d":"108,593"},{"v":83492.49407100001,"d":"83,492"},{"v":49104.170093,"d":"49,104"},{"v":5108.182510000001,"d":"5,108"},{"v":75533.43365300003,"d":"75,533"},{"v":133030,"d":"133,030"},{"v":109186,"d":"109,186"},{"v":36801,"d":"36,801"},null,{"v":44427,"d":"44,427"},{"v":0,"d":"0.0"},{"v":3813,"d":"3,813"},{"v":6840,"d":"6,840"},{"v":2510,"d":"2,510"},{"v":15389,"d":"15,389"},{"v":1770,"d":"1,770"},{"v":9422,"d":"9,422"},{"v":10644333,"d":"10,644,333"},"N/A",0,{"v":9102.60955724062,"d":"9,103"},{"v":3010.7827405707812,"d":"3,011"},{"v":2190,"d":"2,190"},{"v":2200,"d":"2,200"},{"v":2125,"d":"2,125"},{"v":2125,"d":"2,125"},{"v":2095,"d":"2,095"},{"v":2010,"d":"2,010"},{"v":1925,"d":"1,925"},{"v":1875,"d":"1,875"},{"v":1870,"d":"1,870"},{"v":1810,"d":"1,810"},{"v":1790,"d":"1,790"},323,297,279,256,191,153,114,109,0,0,0,0,{"v":4721,"d":"4,721"},{"v":4433,"d":"4,433"},{"v":4315,"d":"4,315"},{"v":4371,"d":"4,371"},327,305,284,265,207,168,122,119,{"v":3498,"d":"3,498"},{"v":3460,"d":"3,460"},{"v":3399,"d":"3,399"},{"v":3362,"d":"3,362"},{"v":4842,"d":"4,842"},{"v":4564,"d":"4,564"},{"v":4464,"d":"4,464"},{"v":4523,"d":"4,523"},0,0,0,0,117,119,113,111,{"v":4728,"d":"4,728"},{"v":4766,"d":"4,766"},{"v":4878,"d":"4,878"},{"v":4956,"d":"4,956"},{"v":3498,"d":"3,498"},{"v":3460,"d":"3,460"},{"v":3399,"d":"3,399"},{"v":3362,"d":"3,362"},{"v":4032,"d":"4,032"},{"v":3933,"d":"3,933"},{"v":3805,"d":"3,805"},{"v":3746,"d":"3,746"},{"v":65690,"d":"65,690"},{"v":242.6,"d":"242.60"},{"v":2708.2000000000003,"d":"2,708.20"},{"v":2128.4,"d":"2,128.40"},{"v":34.4,"d":"34.40"},{"v":114.3,"d":"114.30"},{"v":219.9,"d":"219.90"}]
[124,9,{"$f":"IF('iaith - language'!$K$1=2,VLOOKUP(A16,Text!$A$3:$C$353,2,FALSE),VLOOKUP(A16,Text!$A$3:$C$353,3,FALSE))","v":"Sir Ceredigion"},279,261,202,"N/A","N/A",{"v":178837.254,"d":"178,837"},{"v":70908.660649,"d":"70,909"},{"v":603.194981,"d":"603"},{"v":6003.661797000001,"d":"6,004"},{"v":9810.987159000002,"d":"9,811"},{"v":3792.6399390000006,"d":"3,793"},{"v":10029.404332,"d":"10,029"},{"v":60170.919559999995,"d":"60,171"},{"v":2366.196978,"d":"2,366"},{"v":12206.091824000001,"d":"12,206"},{"v":39484.645574999995,"d":"39,485"},{"v":58702.568836000006,"d":"58,703"},{"v":46411.777791000015,"d":"46,412"},{"v":24496.882868999994,"d":"24,497"},{"v":2699.637987,"d":"2,700"},{"v":42008.40117,"d":"42,008"},{"v":72895,"d":"72,895"},{"v":60661,"d":"60,661"},{"v":18668,"d":"18,668"},null,{"v":10943,"d":"10,943"},{"v":12.915,"d":"12.9"},{"v":1905,"d":"1,905"},{"v":3990,"d":"3,990"},{"v":1410,"d":"1,410"},{"v":6800,"d":"6,800"},838,{"v":5409,"d":"5,409"},{"v":6264194.04,"d":"6,264,194"},"N/A",0,{"v":7196.841815141547,"d":"7,197"},{"v":1576.273821438412,"d":"1,576"},{"v":1320,"d":"1,320"},{"v":1305,"d":"1,305"},{"v":1285,"d":"1,285"},{"v":1355,"d":"1,355"},{"v":1365,"d":"1,365"},{"v":1325,"d":"1,325"},{"v":1220,"d":"1,220"},{"v":1120,"d":"1,120"},{"v":1075,"d":"1,075"},{"v":1090,"d":"1,090"},{"v":1120,"d":"1,120"},171,162,150,136,89,63,69,61,0,0,0,0,{"v":2732,"d":"2,732"},{"v":2591,"d":"2,591"},{"v":2556,"d":"2,556"},{"v":2657,"d":"2,657"},170,161,155,143,93,65,70,60,{"v":2002,"d":"2,002"},{"v":2008,"d":"2,008"},{"v":1974,"d":"1,974"},{"v":1939,"d":"1,939"},{"v":2818,"d":"2,818"},{"v":2671,"d":"2,671"},{"v":2638,"d":"2,638"},{"v":2748,"d":"2,748"},0,0,0,0,29,27,29,29,{"v":2753,"d":"2,753"},{"v":2773,"d":"2,773"},{"v":2774,"d":"2,774"},{"v":2815,"d":"2,815"},{"v":2002,"d":"2,002"},{"v":2008,"d":"2,008"},{"v":1974,"d":"1,974"},{"v":1939,"d":"1,939"},{"v":2265,"d":"2,265"},{"v":2234,"d":"2,234"},{"v":2199,"d":"2,199"},{"v":2142,"d":"2,142"},{"v":35750,"d":"35,750"},{"v":158.3,"d":"158.30"},{"v":1166.6,"d":"1,166.60"},{"v":826.1,"d":"826.10"},{"v":34.4,"d":"34.40"},{"v":100.80000000000001,"d":"100.80"},{"v":124.7,"d":"124.70"}]
[125,10,{"$f":"IF('iaith - language'!$K$1=2,VLOOKUP(A17,Text!$A$3:$C$353,2,FALSE),VLOOKUP(A17,Text!$A$3:$C$353,3,FALSE))","v":"Sir Benfro"},237,276,247,"N/A","N/A",{"v":161834.5,"d":"161,835"},{"v":126580.200618,"d":"126,580"},{"v":1156.472605,"d":"1,156"},{"v":11657.174438,"d":"11,657"},{"v":19167.045073,"d":"19,167"},{"v":7609.250525999999,"d":"7,609"},{"v":13738.594684999998,"d":"13,739"},{"v":105539.119014,"d":"105,539"},{"v":4222.101089,"d":"4,222"},{"v":23905.013199000005,"d":"23,905"},{"v":67957.68757600001,"d":"67,958"},{"v":102675.18742300001,"d":"102,675"},{"v":81876.04376999997,"d":"81,876"},{"v":44704.156852,"d":"44,704"},{"v":4738.55148,"d":"4,739"},{"v":72691.72102800003,"d":"72,692"},{"v":126751,"d":"126,751"},{"v":102744,"d":"102,744"},{"v":33169,"d":"33,169"},null,0,12.3,{"v":1702,"d":"1,702"},{"v":7370,"d":"7,370"},{"v":2240,"d":"2,240"},{"v":15625,"d":"15,625"},{"v":1582,"d":"1,582"},{"v":9495,"d":"9,495"},{"v":9504469,"d":"9,504,469"},"N/A",{"v":2116,"d":"2,116"},{"v":14583.462032534306,"d":"14,583"},{"v":2051.6604497195,"d":"2,052"},{"v":2815,"d":"2,815"},{"v":2795,"d":"2,795"},{"v":2795,"d":"2,795"},{"v":2875,"d":"2,875"},{"v":2870,"d":"2,870"},{"v":2770,"d":"2,770"},{"v":2395,"d":"2,395"},{"v":2235,"d":"2,235"},{"v":2175,"d":"2,175"},{"v":2125,"d":"2,125"},{"v":2150,"d":"2,150"},516,486,447,419,329,283,263,246,0,0,0,0,{"v":5769,"d":"5,769"},{"v":5516,"d":"5,516"},{"v":5499,"d":"5,499"},{"v":5718,"d":"5,718"},529,494,447,422,340,289,271,249,{"v":3761,"d":"3,761"},{"v":3698,"d":"3,698"},{"v":3656,"d":"3,656"},{"v":3597,"d":"3,597"},{"v":5920,"d":"5,920"},{"v":5666,"d":"5,666"},{"v":5641,"d":"5,641"},{"v":5872,"d":"5,872"},0,0,0,0,64,70,64,64,{"v":5571,"d":"5,571"},{"v":5634,"d":"5,634"},{"v":5736,"d":"5,736"},{"v":5845,"d":"5,845"},{"v":3761,"d":"3,761"},{"v":3698,"d":"3,698"},{"v":3656,"d":"3,656"},{"v":3597,"d":"3,597"},{"v":4630,"d":"4,630"},{"v":4481,"d":"4,481"},{"v":4374,"d":"4,374"},{"v":4268,"d":"4,268"},{"v":62140,"d":"62,140"},{"v":160.5,"d":"160.50"},{"v":1220.5,"d":"1,220.50"},{"v":1105.6,"d":"1,105.60"},{"v":55.6,"d":"55.60"},{"v":171.4,"d":"171.40"},{"v":330.8,"d":"330.80"}]
[126,11,{"$f":"IF('iaith - language'!$K$1=2,VLOOKUP(A18,Text!$A$3:$C$353,2,FALSE),VLOOKUP(A18,Text!$A$3:$C$353,3,FALSE))","v":"Sir Gaerfyrddin"},442,"-",398,"N/A","N/A",{"v":237111.94400000002,"d":"237,112"},{"v":190021.678149,"d":"190,022"},{"v":1940.018197,"d":"1,940"},{"v":18695.342395,"d":"18,695"},{"v":30302.20487,"d":"30,302"},{"v":11610.044547000001,"d":"11,610"},{"v":21415.398842,"d":"21,415"},{"v":156534.058723,"d":"156,534"},{"v":6599.682223,"d":"6,600"},{"v":38020.82709499999,"d":"38,021"},{"v":105181.81911699999,"d":"105,182"},{"v":152000.85105400003,"d":"152,001"},{"v":128904.27466199998,"d":"128,904"},{"v":61117.40348699999,"d":"61,117"},{"v":5606.845335,"d":"5,607"},{"v":112449.98532399995,"d":"112,450"},{"v":190073,"d":"190,073"},{"v":152810,"d":"152,810"},{"v":45693,"d":"45,693"},null,0,{"v":9.06,"d":"9.1"},{"v":2974,"d":"2,974"},{"v":7050,"d":"7,050"},{"v":2690,"d":"2,690"},{"v":20667,"d":"20,667"},{"v":2592,"d":"2,592"},{"v":15526,"d":"15,526"},{"v":17055247.14,"d":"17,055,247"},"N/A",0,{"v":4708.469984729656,"d":"4,708"},{"v":2314.5232160613473,"d":"2,315"},{"v":4145,"d":"4,145"},{"v":3925,"d":"3,925"},{"v":3780,"d":"3,780"},{"v":3760,"d":"3,760"},{"v":3700,"d":"3,700"},{"v":3530,"d":"3,530"},{"v":3310,"d":"3,310"},{"v":3295,"d":"3,295"},{"v":3170,"d":"3,170"},{"v":3125,"d":"3,125"},{"v":3210,"d":"3,210"},742,692,642,610,456,370,315,278,0,0,0,0,{"v":8699,"d":"8,699"},{"v":8609,"d":"8,609"},{"v":8361,"d":"8,361"},{"v":8409,"d":"8,409"},754,699,650,619,470,379,323,288,{"v":5516,"d":"5,516"},{"v":5466,"d":"5,466"},{"v":5394,"d":"5,394"},{"v":5305,"d":"5,305"},{"v":8920,"d":"8,920"},{"v":8833,"d":"8,833"},{"v":8581,"d":"8,581"},{"v":8645,"d":"8,645"},0,0,0,0,113,109,103,108,{"v":9782,"d":"9,782"},{"v":9955,"d":"9,955"},{"v":10157,"d":"10,157"},{"v":10336,"d":"10,336"},{"v":5515,"d":"5,515"},{"v":5463,"d":"5,463"},{"v":5387,"d":"5,387"},{"v":5308,"d":"5,308"},{"v":6740,"d":"6,740"},{"v":6544,"d":"6,544"},{"v":6367,"d":"6,367"},{"v":6212,"d":"6,212"},{"v":89170,"d":"89,170"},{"v":249.6,"d":"249.60"},{"v":1615.6,"d":"1,615.60"},{"v":1653.3,"d":"1,653.30"},{"v":90.4,"d":"90.40"},{"v":196.5,"d":"196.50"},{"v":409.3,"d":"409.30"}]
[127,12,{"$f":"IF('iaith - language'!$K$1=2,VLOOKUP(A19,Text!$A$3:$C$353,2,FALSE),VLOOKUP(A19,Text!$A$3:$C$353,3,FALSE))","v":"Abertawe"},672,550,593,"N/A","N/A",{"v":37761.379,"d":"37,761"},{"v":250004.394915,"d":"250,004"},{"v":2550.884143,"d":"2,551"},{"v":23858.750966,"d":"23,859"},{"v":37707.15169399999,"d":"37,707"},{"v":14040.285487000001,"d":"14,040"},{"v":31556.96688,"d":"31,557"},{"v":207529.389571,"d":"207,529"},{"v":8439.738762,"d":"8,440"},{"v":47970.078263,"d":"47,970"},{"v":151800.78418100005,"d":"151,801"},{"v":202034.316651,"d":"202,034"},{"v":185022.62904400003,"d":"185,023"},{"v":64981.76586999999,"d":"64,982"},{"v":6823.437462,"d":"6,823"},{"v":160172.77484899995,"d":"160,173"},{"v":246563,"d":"246,563"},{"v":199723,"d":"199,723"},{"v":48958,"d":"48,958"},null,0,7.9,366,{"v":7680,"d":"7,680"},{"v":2930,"d":"2,930"},{"v":29153,"d":"29,153"},{"v":2747,"d":"2,747"},{"v":21467,"d":"21,467"},{"v":23138914.92,"d":"23,138,915"},"N/A",138,{"v":5424.424152535633,"d":"5,424"},{"v":3124.81842892492,"d":"3,125"},{"v":6725,"d":"6,725"},{"v":6445,"d":"6,445"},{"v":6275,"d":"6,275"},{"v":6110,"d":"6,110"},{"v":6105,"d":"6,105"},{"v":5850,"d":"5,850"},{"v":5650,"d":"5,650"},{"v":5465,"d":"5,465"},{"v":5395,"d":"5,395"},{"v":5285,"d":"5,285"},{"v":5375,"d":"5,375"},{"v":1064,"d":"1,064"},999,926,882,622,527,433,436,0,0,0,0,{"v":14403,"d":"14,403"},{"v":13986,"d":"13,986"},{"v":13636,"d":"13,636"},{"v":13767,"d":"13,767"},{"v":1074,"d":"1,074"},{"v":1011,"d":"1,011"},935,890,647,545,452,453,{"v":6965,"d":"6,965"},{"v":6894,"d":"6,894"},{"v":6821,"d":"6,821"},{"v":6708,"d":"6,708"},{"v":14714,"d":"14,714"},{"v":14307,"d":"14,307"},{"v":13985,"d":"13,985"},{"v":14134,"d":"14,134"},0,0,0,0,142,141,146,143,{"v":13042,"d":"13,042"},{"v":13214,"d":"13,214"},{"v":13386,"d":"13,386"},{"v":13673,"d":"13,673"},{"v":6965,"d":"6,965"},{"v":6894,"d":"6,894"},{"v":6821,"d":"6,821"},{"v":6708,"d":"6,708"},{"v":8686,"d":"8,686"},{"v":8450,"d":"8,450"},{"v":8208,"d":"8,208"},{"v":8051,"d":"8,051"},{"v":114300,"d":"114,300"},{"v":102.3,"d":"102.30"},{"v":231.2,"d":"231.20"},{"v":779.4,"d":"779.40"},{"v":70.7,"d":"70.70"},{"v":138.9,"d":"138.90"},{"v":650.9,"d":"650.90"}]
[128,13,{"$f":"IF('iaith - language'!$K$1=2,VLOOKUP(A20,Text!$A$3:$C$353,2,FALSE),VLOOKUP(A20,Text!$A$3:$C$353,3,FALSE))","v":"Castell-nedd Port Talbot"},254,203,191,"N/A","N/A",{"v":44227.29,"d":"44,227"},{"v":144893.843445,"d":"144,894"},{"v":1524.043975,"d":"1,524"},{"v":14346.493953000001,"d":"14,346"},{"v":22739.58185,"d":"22,740"},{"v":8493.788502,"d":"8,494"},{"v":16430.081065,"d":"16,430"},{"v":119385.20160100001,"d":"119,385"},{"v":4988.268847,"d":"4,988"},{"v":28822.992894,"d":"28,823"},{"v":84939.482085,"d":"84,939"},{"v":116070.85055499997,"d":"116,071"},{"v":103725.51942699998,"d":"103,726"},{"v":41168.32402200001,"d":"41,168"},{"v":3578.049889,"d":"3,578"},{"v":90176.51702900002,"d":"90,177"},{"v":144386,"d":"144,386"},{"v":116296,"d":"116,296"},{"v":30254,"d":"30,254"},null,0,2.9,219,{"v":4040,"d":"4,040"},{"v":1780,"d":"1,780"},{"v":19547,"d":"19,547"},{"v":1839,"d":"1,839"},{"v":16382,"d":"16,382"},{"v":19007177.13,"d":"19,007,177"},"N/A",177,{"v":921.7262739174663,"d":"922"},{"v":1145.5310161670388,"d":"1,146"},{"v":3610,"d":"3,610"},{"v":3475,"d":"3,475"},{"v":3380,"d":"3,380"},{"v":3365,"d":"3,365"},{"v":3395,"d":"3,395"},{"v":3240,"d":"3,240"},{"v":3015,"d":"3,015"},{"v":2905,"d":"2,905"},{"v":2775,"d":"2,775"},{"v":2700,"d":"2,700"},{"v":2735,"d":"2,735"},857,812,767,736,263,167,143,141,0,0,0,0,{"v":8962,"d":"8,962"},{"v":8769,"d":"8,769"},{"v":8664,"d":"8,664"},{"v":8792,"d":"8,792"},868,818,778,743,274,181,155,149,{"v":4591,"d":"4,591"},{"v":4528,"d":"4,528"},{"v":4453,"d":"4,453"},{"v":4362,"d":"4,362"},{"v":9150,"d":"9,150"},{"v":8984,"d":"8,984"},{"v":8866,"d":"8,866"},{"v":9002,"d":"9,002"},0,0,0,0,113,115,112,117,{"v":9527,"d":"9,527"},{"v":9642,"d":"9,642"},{"v":9770,"d":"9,770"},{"v":9953,"d":"9,953"},{"v":4591,"d":"4,591"},{"v":4528,"d":"4,528"},{"v":4453,"d":"4,453"},{"v":4362,"d":"4,362"},{"v":5733,"d":"5,733"},{"v":5527,"d":"5,527"},{"v":5386,"d":"5,386"},{"v":5254,"d":"5,254"},{"v":66880,"d":"66,880"},{"v":118,"d":"118.00"},{"v":116.1,"d":"116.10"},{"v":599.3,"d":"599.30"},{"v":66.3,"d":"66.30"},{"v":68.8,"d":"68.80"},{"v":479.4,"d":"479.40"}]
[129,14,{"$f":"IF('iaith - language'!$K$1=2,VLOOKUP(A21,Text!$A$3:$C$353,2,FALSE),VLOOKUP(A21,Text!$A$3:$C$353,3,FALSE))","v":"Pen-y-bont ar Ogwr"},331,278,230,"N/A","N/A",{"v":25078.531,"d":"25,079"},{"v":148575.751181,"d":"148,576"},{"v":1638.034111,"d":"1,638"},{"v":15239.937970000003,"d":"15,240"},{"v":23903.597855000004,"d":"23,904"},{"v":8799.197772,"d":"8,799"},{"v":16238.818263999998,"d":"16,239"},{"v":121686.764081,"d":"121,687"},{"v":5019.807559000001,"d":"5,020"},{"v":30301.253043000008,"d":"30,301"},{"v":86939.738307,"d":"86,940"},{"v":118274.49814700003,"d":"118,274"},{"v":107233.59970900003,"d":"107,234"},{"v":41342.15148099999,"d":"41,342"},{"v":3629.0844099999995,"d":"3,629"},{"v":92164.60236000002,"d":"92,165"},{"v":147539,"d":"147,539"},{"v":118204,"d":"118,204"},{"v":30168,"d":"30,168"},null,0,{"v":2.35,"d":"2.4"},194,{"v":5090,"d":"5,090"},{"v":1790,"d":"1,790"},{"v":19761,"d":"19,761"},{"v":1717,"d":"1,717"},{"v":12606,"d":"12,606"},{"v":15237098,"d":"15,237,098"},"N/A",0,{"v":2664.300692537582,"d":"2,664"},{"v":3061.249452487455,"d":"3,061"},{"v":3540,"d":"3,540"},{"v":3455,"d":"3,455"},{"v":3330,"d":"3,330"},{"v":3330,"d":"3,330"},{"v":3320,"d":"3,320"},{"v":3195,"d":"3,195"},{"v":2985,"d":"2,985"},{"v":2900,"d":"2,900"},{"v":2890,"d":"2,890"},{"v":2815,"d":"2,815"},{"v":2835,"d":"2,835"},772,722,673,630,229,183,172,160,0,0,0,0,{"v":8069,"d":"8,069"},{"v":7798,"d":"7,798"},{"v":7534,"d":"7,534"},{"v":7625,"d":"7,625"},781,726,676,635,227,188,179,169,{"v":3701,"d":"3,701"},{"v":3676,"d":"3,676"},{"v":3605,"d":"3,605"},{"v":3559,"d":"3,559"},{"v":8279,"d":"8,279"},{"v":8029,"d":"8,029"},{"v":7762,"d":"7,762"},{"v":7853,"d":"7,853"},0,0,0,0,128,135,134,120,{"v":7827,"d":"7,827"},{"v":7915,"d":"7,915"},{"v":8051,"d":"8,051"},{"v":8226,"d":"8,226"},{"v":3701,"d":"3,701"},{"v":3676,"d":"3,676"},{"v":3605,"d":"3,605"},{"v":3559,"d":"3,559"},{"v":4709,"d":"4,709"},{"v":4590,"d":"4,590"},{"v":4460,"d":"4,460"},{"v":4363,"d":"4,363"},{"v":65610,"d":"65,610"},{"v":104,"d":"104.00"},{"v":139,"d":"139.00"},{"v":545.8,"d":"545.80"},{"v":52.3,"d":"52.30"},{"v":83.3,"d":"83.30"},{"v":443.4,"d":"443.40"}]
[130,15,{"$f":"IF('iaith - language'!$K$1=2,VLOOKUP(A22,Text!$A$3:$C$353,2,FALSE),VLOOKUP(A22,Text!$A$3:$C$353,3,FALSE))","v":"Bro Morgannwg"},451,413,328,"N/A","N/A",{"v":33126.139,"d":"33,126"},{"v":136448.147372,"d":"136,448"},{"v":1510.194318,"d":"1,510"},{"v":14313.849275999999,"d":"14,314"},{"v":22797.390890999995,"d":"22,797"},{"v":8544.326735999999,"d":"8,544"},{"v":15362.837621,"d":"15,363"},{"v":111085.488346,"d":"111,085"},{"v":4823.420697,"d":"4,823"},{"v":28637.946954999996,"d":"28,638"},{"v":77556.36750200001,"d":"77,556"},{"v":107810.20041799996,"d":"107,810"},{"v":96875.72447300001,"d":"96,876"},{"v":39572.422900000005,"d":"39,572"},{"v":3634.451141,"d":"3,634"},{"v":82522.38291500002,"d":"82,522"},{"v":135295,"d":"135,295"},{"v":107403,"d":"107,403"},{"v":28838,"d":"28,838"},null,0,{"v":4,"d":"4.0"},285,{"v":3590,"d":"3,590"},{"v":1540,"d":"1,540"},{"v":15740,"d":"15,740"},{"v":1467,"d":"1,467"},{"v":9472,"d":"9,472"},{"v":11124862,"d":"11,124,862"},"N/A",47,{"v":2239.696563194744,"d":"2,240"},{"v":3669.029081886837,"d":"3,669"},{"v":2915,"d":"2,915"},{"v":2865,"d":"2,865"},{"v":2725,"d":"2,725"},{"v":2670,"d":"2,670"},{"v":2720,"d":"2,720"},{"v":2640,"d":"2,640"},{"v":2555,"d":"2,555"},{"v":2445,"d":"2,445"},{"v":2445,"d":"2,445"},{"v":2355,"d":"2,355"},{"v":2355,"d":"2,355"},522,495,463,434,321,256,212,207,0,0,0,0,{"v":5941,"d":"5,941"},{"v":5693,"d":"5,693"},{"v":5488,"d":"5,488"},{"v":5577,"d":"5,577"},528,503,472,441,329,269,216,209,{"v":2960,"d":"2,960"},{"v":2948,"d":"2,948"},{"v":2895,"d":"2,895"},{"v":2853,"d":"2,853"},{"v":6065,"d":"6,065"},{"v":5831,"d":"5,831"},{"v":5633,"d":"5,633"},{"v":5714,"d":"5,714"},0,0,0,0,81,73,74,74,{"v":5162,"d":"5,162"},{"v":5223,"d":"5,223"},{"v":5351,"d":"5,351"},{"v":5516,"d":"5,516"},{"v":2960,"d":"2,960"},{"v":2948,"d":"2,948"},{"v":2895,"d":"2,895"},{"v":2853,"d":"2,853"},{"v":3817,"d":"3,817"},{"v":3720,"d":"3,720"},{"v":3583,"d":"3,583"},{"v":3503,"d":"3,503"},{"v":60970,"d":"60,970"},{"v":73.9,"d":"73.90"},{"v":371.1,"d":"371.10"},{"v":593.3,"d":"593.30"},{"v":21.4,"d":"21.40"},{"v":53.5,"d":"53.50"},{"v":374.9,"d":"374.90"}]
[131,16,{"$f":"IF('iaith - language'!$K$1=2,VLOOKUP(A23,Text!$A$3:$C$353,2,FALSE),VLOOKUP(A23,Text!$A$3:$C$353,3,FALSE))","v":"Rhondda Cynon Taf"},453,381,334,"N/A","N/A",{"v":42415.086,"d":"42,415"},{"v":243405.987166,"d":"243,406"},{"v":2691.164998,"d":"2,691"},{"v":25066.103719,"d":"25,066"},{"v":39843.272455,"d":"39,843"},{"v":14955.337703000001,"d":"14,955"},{"v":29029.915934,"d":"29,030"},{"v":198505.77527,"d":"198,506"},{"v":8508.444727,"d":"8,508"},{"v":50602.855898999995,"d":"50,603"},{"v":144713.58417800002,"d":"144,714"},{"v":192803.13126600004,"d":"192,803"},{"v":180178.10645999995,"d":"180,178"},{"v":63227.880704999996,"d":"63,228"},{"v":5612.533129,"d":"5,613"},{"v":153324.06568799994,"d":"153,324"},{"v":241873,"d":"241,873"},{"v":191775,"d":"191,775"},{"v":46755,"d":"46,755"},null,0,{"v":0,"d":"0.0"},263,{"v":7220,"d":"7,220"},{"v":3010,"d":"3,010"},{"v":29879,"d":"29,879"},{"v":2713,"d":"2,713"},{"v":24082,"d":"24,082"},{"v":25150072.491,"d":"25,150,072"},"N/A",0,{"v":1282.9150998168502,"d":"1,283"},{"v":1575.144551455473,"d":"1,575"},{"v":6480,"d":"6,480"},{"v":6145,"d":"6,145"},{"v":5945,"d":"5,945"},{"v":5950,"d":"5,950"},{"v":5840,"d":"5,840"},{"v":5705,"d":"5,705"},{"v":5285,"d":"5,285"},{"v":5200,"d":"5,200"},{"v":5070,"d":"5,070"},{"v":4900,"d":"4,900"},{"v":4825,"d":"4,825"},{"v":1551,"d":"1,551"},{"v":1434,"d":"1,434"},{"v":1314,"d":"1,314"},{"v":1241,"d":"1,241"},586,401,258,276,0,0,0,0,{"v":13728,"d":"13,728"},{"v":13350,"d":"13,350"},{"v":12944,"d":"12,944"},{"v":13238,"d":"13,238"},{"v":1569,"d":"1,569"},{"v":1450,"d":"1,450"},{"v":1326,"d":"1,326"},{"v":1252,"d":"1,252"},605,412,259,280,{"v":7221,"d":"7,221"},{"v":7140,"d":"7,140"},{"v":6999,"d":"6,999"},{"v":6897,"d":"6,897"},{"v":13967,"d":"13,967"},{"v":13623,"d":"13,623"},{"v":13227,"d":"13,227"},{"v":13551,"d":"13,551"},0,0,0,0,218,207,195,193,{"v":14251,"d":"14,251"},{"v":14468,"d":"14,468"},{"v":14762,"d":"14,762"},{"v":15114,"d":"15,114"},{"v":7221,"d":"7,221"},{"v":7140,"d":"7,140"},{"v":6999,"d":"6,999"},{"v":6897,"d":"6,897"},{"v":9395,"d":"9,395"},{"v":9002,"d":"9,002"},{"v":8584,"d":"8,584"},{"v":8429,"d":"8,429"},{"v":110810,"d":"110,810"},{"v":165.4,"d":"165.40"},{"v":199.7,"d":"199.70"},{"v":930.5,"d":"930.50"},{"v":76.1,"d":"76.10"},{"v":127.80000000000001,"d":"127.80"},{"v":794.7,"d":"794.70"}]
[132,17,{"$f":"IF('iaith - language'!$K$1=2,VLOOKUP(A24,Text!$A$3:$C$353,2,FALSE),VLOOKUP(A24,Text!$A$3:$C$353,3,FALSE))","v":"Merthyr Tudful"},120,118,80,"N/A","N/A",{"v":11195.813,"d":"11,196"},{"v":61079.742983,"d":"61,080"},{"v":723.31004,"d":"723"},{"v":6792.217533,"d":"6,792"},{"v":10554.360031,"d":"10,554"},{"v":3807.939133,"d":"3,808"},{"v":7045.593962000001,"d":"7,046"},{"v":49187.586941,"d":"49,188"},{"v":2080.088201,"d":"2,080"},{"v":13326.066724,"d":"13,326"},{"v":35881.69104900001,"d":"35,882"},{"v":47753.676262999994,"d":"47,754"},{"v":45125.143561,"d":"45,125"},{"v":15954.599426,"d":"15,955"},{"v":1330.490498,"d":"1,330"},{"v":38099.77061099998,"d":"38,100"},{"v":60424,"d":"60,424"},{"v":47544,"d":"47,544"},{"v":11394,"d":"11,394"},null,0,{"v":0,"d":"0.0"},49,{"v":1790,"d":"1,790"},780,{"v":7504,"d":"7,504"},696,{"v":6058,"d":"6,058"},{"v":6742440,"d":"6,742,440"},"N/A",0,{"v":552.4434859338008,"d":"552"},{"v":1159.6662096807067,"d":"1,160"},{"v":1750,"d":"1,750"},{"v":1715,"d":"1,715"},{"v":1655,"d":"1,655"},{"v":1610,"d":"1,610"},{"v":1660,"d":"1,660"},{"v":1635,"d":"1,635"},{"v":1500,"d":"1,500"},{"v":1450,"d":"1,450"},{"v":1435,"d":"1,435"},{"v":1410,"d":"1,410"},{"v":1425,"d":"1,425"},388,366,346,320,166,147,118,111,0,0,0,0,{"v":4013,"d":"4,013"},{"v":3978,"d":"3,978"},{"v":3783,"d":"3,783"},{"v":3826,"d":"3,826"},383,370,346,327,170,155,124,120,{"v":1843,"d":"1,843"},{"v":1843,"d":"1,843"},{"v":1836,"d":"1,836"},{"v":1806,"d":"1,806"},{"v":4100,"d":"4,100"},{"v":4069,"d":"4,069"},{"v":3877,"d":"3,877"},{"v":3924,"d":"3,924"},0,0,0,0,72,75,77,72,{"v":3988,"d":"3,988"},{"v":4044,"d":"4,044"},{"v":4108,"d":"4,108"},{"v":4195,"d":"4,195"},{"v":1843,"d":"1,843"},{"v":1843,"d":"1,843"},{"v":1836,"d":"1,836"},{"v":1806,"d":"1,806"},{"v":2396,"d":"2,396"},{"v":2368,"d":"2,368"},{"v":2306,"d":"2,306"},{"v":2253,"d":"2,253"},{"v":27490,"d":"27,490"},{"v":27.6,"d":"27.60"},{"v":52.800000000000004,"d":"52.80"},{"v":222,"d":"222.00"},{"v":22.2,"d":"22.20"},{"v":40.7,"d":"40.70"},{"v":191.5,"d":"191.50"}]
[133,18,{"$f":"IF('iaith - language'!$K$1=2,VLOOKUP(A25,Text!$A$3:$C$353,2,FALSE),VLOOKUP(A25,Text!$A$3:$C$353,3,FALSE))","v":"Caerffili"},305,271,221,"N/A","N/A",{"v":27738.781,"d":"27,739"},{"v":182235.632233,"d":"182,236"},{"v":1997.278917,"d":"1,997"},{"v":18615.633743000002,"d":"18,616"},{"v":29865.491134000004,"d":"29,865"},{"v":11267.516846,"d":"11,268"},{"v":21033.015847000002,"d":"21,033"},{"v":148681.684863,"d":"148,682"},{"v":6277.155559999999,"d":"6,277"},{"v":37840.068834000005,"d":"37,840"},{"v":107174.45710099999,"d":"107,174"},{"v":144395.56339999998,"d":"144,396"},{"v":133339.60511800004,"d":"133,340"},{"v":48896.02711599999,"d":"48,896"},{"v":4157.662007,"d":"4,158"},{"v":113600.80998500001,"d":"113,601"},{"v":181731,"d":"181,731"},{"v":144061,"d":"144,061"},{"v":35672,"d":"35,672"},null,0,{"v":0,"d":"0.0"},233,{"v":4990,"d":"4,990"},{"v":2010,"d":"2,010"},{"v":27652,"d":"27,652"},{"v":2011,"d":"2,011"},{"v":16244,"d":"16,244"},{"v":15312917,"d":"15,312,917"},"N/A",0,{"v":932.6935815035438,"d":"933"},{"v":1421.469792530034,"d":"1,421"},{"v":4950,"d":"4,950"},{"v":4830,"d":"4,830"},{"v":4690,"d":"4,690"},{"v":4625,"d":"4,625"},{"v":4550,"d":"4,550"},{"v":4395,"d":"4,395"},{"v":4035,"d":"4,035"},{"v":3915,"d":"3,915"},{"v":3910,"d":"3,910"},{"v":3840,"d":"3,840"},{"v":3910,"d":"3,910"},978,916,844,792,636,538,475,419,0,0,0,0,{"v":10334,"d":"10,334"},{"v":10089,"d":"10,089"},{"v":9849,"d":"9,849"},{"v":10004,"d":"10,004"},987,927,857,802,661,552,488,438,{"v":5464,"d":"5,464"},{"v":5404,"d":"5,404"},{"v":5355,"d":"5,355"},{"v":5273,"d":"5,273"},{"v":10547,"d":"10,547"},{"v":10327,"d":"10,327"},{"v":10110,"d":"10,110"},{"v":10278,"d":"10,278"},0,0,0,0,126,117,120,119,{"v":11004,"d":"11,004"},{"v":11242,"d":"11,242"},{"v":11456,"d":"11,456"},{"v":11673,"d":"11,673"},{"v":5464,"d":"5,464"},{"v":5404,"d":"5,404"},{"v":5355,"d":"5,355"},{"v":5273,"d":"5,273"},{"v":7112,"d":"7,112"},{"v":6883,"d":"6,883"},{"v":6700,"d":"6,700"},{"v":6513,"d":"6,513"},{"v":80230,"d":"80,230"},{"v":96.7,"d":"96.70"},{"v":217.3,"d":"217.30"},{"v":859.1,"d":"859.10"},{"v":30.4,"d":"30.40"},{"v":130,"d":"130.00"},{"v":697.4,"d":"697.40"}]
[134,19,{"$f":"IF('iaith - language'!$K$1=2,VLOOKUP(A26,Text!$A$3:$C$353,2,FALSE),VLOOKUP(A26,Text!$A$3:$C$353,3,FALSE))","v":"Blaenau Gwent"},102,89,74,"N/A","N/A",{"v":10872.805,"d":"10,873"},{"v":69508.098091,"d":"69,508"},{"v":741.734679,"d":"742"},{"v":6757.668578,"d":"6,758"},{"v":10760.333669000001,"d":"10,760"},{"v":3977.1642249999995,"d":"3,977"},{"v":7577.575664999999,"d":"7,578"},{"v":57350.101356,"d":"57,350"},{"v":2355.792202,"d":"2,356"},{"v":13768.336673000002,"d":"13,768"},{"v":41433.603980999986,"d":"41,434"},{"v":55739.76142299998,"d":"55,740"},{"v":50380.70265600001,"d":"50,381"},{"v":19127.39544,"d":"19,127"},{"v":1569.198878,"d":"1,569"},{"v":43867.17303500001,"d":"43,867"},{"v":70020,"d":"70,020"},{"v":56401,"d":"56,401"},{"v":14177,"d":"14,177"},null,0,{"v":0,"d":"0.0"},69,{"v":2170,"d":"2,170"},{"v":1100,"d":"1,100"},{"v":12936,"d":"12,936"},895,{"v":8597,"d":"8,597"},{"v":9739937.77,"d":"9,739,938"},"N/A",0,{"v":418.19730596633957,"d":"418"},{"v":574.3173997772794,"d":"574"},{"v":2245,"d":"2,245"},{"v":2190,"d":"2,190"},{"v":2140,"d":"2,140"},{"v":2100,"d":"2,100"},{"v":2095,"d":"2,095"},{"v":2010,"d":"2,010"},{"v":1925,"d":"1,925"},{"v":1875,"d":"1,875"},{"v":1870,"d":"1,870"},{"v":1810,"d":"1,810"},{"v":1790,"d":"1,790"},428,399,368,353,238,202,163,118,0,0,0,0,{"v":4868,"d":"4,868"},{"v":4661,"d":"4,661"},{"v":4579,"d":"4,579"},{"v":4711,"d":"4,711"},436,402,375,361,250,209,170,128,{"v":2404,"d":"2,404"},{"v":2388,"d":"2,388"},{"v":2347,"d":"2,347"},{"v":2314,"d":"2,314"},{"v":4989,"d":"4,989"},{"v":4788,"d":"4,788"},{"v":4711,"d":"4,711"},{"v":4840,"d":"4,840"},0,0,0,0,54,49,49,53,{"v":4827,"d":"4,827"},{"v":4883,"d":"4,883"},{"v":4970,"d":"4,970"},{"v":5048,"d":"5,048"},{"v":2404,"d":"2,404"},{"v":2388,"d":"2,388"},{"v":2347,"d":"2,347"},{"v":2314,"d":"2,314"},{"v":3090,"d":"3,090"},{"v":2999,"d":"2,999"},{"v":2892,"d":"2,892"},{"v":2803,"d":"2,803"},{"v":33000,"d":"33,000"},{"v":51,"d":"51.00"},{"v":67.7,"d":"67.70"},{"v":389.8,"d":"389.80"},{"v":20.2,"d":"20.20"},{"v":47,"d":"47.00"},{"v":387.8,"d":"387.80"}]
[135,20,{"$f":"IF('iaith - language'!$K$1=2,VLOOKUP(A27,Text!$A$3:$C$353,2,FALSE),VLOOKUP(A27,Text!$A$3:$C$353,3,FALSE))","v":"Torfaen"},169,144,97,"N/A","N/A",{"v":12623.993,"d":"12,624"},{"v":94353.862747,"d":"94,354"},{"v":1042.154696,"d":"1,042"},{"v":9844.981399,"d":"9,845"},{"v":15570.988704,"d":"15,571"},{"v":5773.519844,"d":"5,774"},{"v":10679.643146000002,"d":"10,680"},{"v":76881.781162,"d":"76,882"},{"v":3330.316871,"d":"3,330"},{"v":19712.05667,"d":"19,712"},{"v":54501.64728900001,"d":"54,502"},{"v":74641.80608400004,"d":"74,642"},{"v":67891.15424,"d":"67,891"},{"v":26462.708514,"d":"26,463"},{"v":2567.8158280000002,"d":"2,568"},{"v":57933.59112000002,"d":"57,934"},{"v":94832,"d":"94,832"},{"v":75369,"d":"75,369"},{"v":19543,"d":"19,543"},null,0,{"v":0,"d":"0.0"},113,{"v":2890,"d":"2,890"},{"v":1190,"d":"1,190"},{"v":13643,"d":"13,643"},{"v":1043,"d":"1,043"},{"v":9932,"d":"9,932"},{"v":10218388,"d":"10,218,388"},"N/A",0,{"v":495.0979782324445,"d":"495"},{"v":864.3695556335008,"d":"864"},{"v":2685,"d":"2,685"},{"v":2570,"d":"2,570"},{"v":2585,"d":"2,585"},{"v":2540,"d":"2,540"},{"v":2565,"d":"2,565"},{"v":2460,"d":"2,460"},{"v":2315,"d":"2,315"},{"v":2225,"d":"2,225"},{"v":2185,"d":"2,185"},{"v":2090,"d":"2,090"},{"v":2090,"d":"2,090"},381,364,345,331,153,121,91,88,0,0,0,0,{"v":6278,"d":"6,278"},{"v":6051,"d":"6,051"},{"v":5865,"d":"5,865"},{"v":5985,"d":"5,985"},393,372,347,333,153,119,92,89,{"v":2645,"d":"2,645"},{"v":2631,"d":"2,631"},{"v":2591,"d":"2,591"},{"v":2569,"d":"2,569"},{"v":6398,"d":"6,398"},{"v":6177,"d":"6,177"},{"v":5997,"d":"5,997"},{"v":6128,"d":"6,128"},0,0,0,0,58,56,51,54,{"v":5631,"d":"5,631"},{"v":5733,"d":"5,733"},{"v":5826,"d":"5,826"},{"v":5961,"d":"5,961"},{"v":2645,"d":"2,645"},{"v":2631,"d":"2,631"},{"v":2591,"d":"2,591"},{"v":2569,"d":"2,569"},{"v":3191,"d":"3,191"},{"v":3122,"d":"3,122"},{"v":3030,"d":"3,030"},{"v":2991,"d":"2,991"},{"v":42800,"d":"42,800"},{"v":26.3,"d":"26.30"},{"v":101.6,"d":"101.60"},{"v":326.1,"d":"326.10"},{"v":16.2,"d":"16.20"},{"v":70.8,"d":"70.80"},{"v":292.8,"d":"292.80"}]
[136,21,{"$f":"IF('iaith - language'!$K$1=2,VLOOKUP(A28,Text!$A$3:$C$353,2,FALSE),VLOOKUP(A28,Text!$A$3:$C$353,3,FALSE))","v":"Sir Fynwy"},301,303,266,"N/A","N/A",{"v":85032.636,"d":"85,033"},{"v":95825.850721,"d":"95,826"},{"v":851.397903,"d":"851"},{"v":8502.274261,"d":"8,502"},{"v":14149.099555,"d":"14,149"},{"v":5519.671599,"d":"5,520"},{"v":9977.674448,"d":"9,978"},{"v":80467.80833,"d":"80,468"},{"v":3241.9159059999997,"d":"3,242"},{"v":17604.102537000002,"d":"17,604"},{"v":52719.426049999995,"d":"52,719"},{"v":78221.74819400003,"d":"78,222"},{"v":62996.450713000006,"d":"62,996"},{"v":32829.40001800001,"d":"32,829"},{"v":3544.7546899999998,"d":"3,545"},{"v":56301.713492,"d":"56,302"},{"v":95164,"d":"95,164"},{"v":77843,"d":"77,843"},{"v":24340,"d":"24,340"},null,{"v":93511,"d":"93,511"},{"v":0,"d":"0.0"},997,{"v":3190,"d":"3,190"},{"v":1220,"d":"1,220"},{"v":10900,"d":"10,900"},{"v":1114,"d":"1,114"},{"v":5669,"d":"5,669"},{"v":7219377,"d":"7,219,377"},"N/A",0,{"v":1540.2404293141194,"d":"1,540"},{"v":1724.7169712777525,"d":"1,725"},{"v":1610,"d":"1,610"},{"v":1530,"d":"1,530"},{"v":1475,"d":"1,475"},{"v":1445,"d":"1,445"},{"v":1475,"d":"1,475"},{"v":1410,"d":"1,410"},{"v":1310,"d":"1,310"},{"v":1320,"d":"1,320"},{"v":1290,"d":"1,290"},{"v":1330,"d":"1,330"},{"v":1365,"d":"1,365"},194,182,171,162,201,143,134,136,0,0,0,0,{"v":3202,"d":"3,202"},{"v":2998,"d":"2,998"},{"v":2851,"d":"2,851"},{"v":2878,"d":"2,878"},194,187,174,163,217,154,148,145,{"v":1941,"d":"1,941"},{"v":1915,"d":"1,915"},{"v":1887,"d":"1,887"},{"v":1863,"d":"1,863"},{"v":3280,"d":"3,280"},{"v":3076,"d":"3,076"},{"v":2930,"d":"2,930"},{"v":2961,"d":"2,961"},0,0,0,0,57,61,56,54,{"v":3156,"d":"3,156"},{"v":3200,"d":"3,200"},{"v":3238,"d":"3,238"},{"v":3294,"d":"3,294"},{"v":1933,"d":"1,933"},{"v":1910,"d":"1,910"},{"v":1882,"d":"1,882"},{"v":1854,"d":"1,854"},{"v":2352,"d":"2,352"},{"v":2256,"d":"2,256"},{"v":2209,"d":"2,209"},{"v":2171,"d":"2,171"},{"v":43380,"d":"43,380"},{"v":58.7,"d":"58.70"},{"v":616.1,"d":"616.10"},{"v":839,"d":"839.00"},{"v":14.9,"d":"14.90"},{"v":70.4,"d":"70.40"},{"v":189.9,"d":"189.90"}]
[137,22,{"$f":"IF('iaith - language'!$K$1=2,VLOOKUP(A29,Text!$A$3:$C$353,2,FALSE),VLOOKUP(A29,Text!$A$3:$C$353,3,FALSE))","v":"Casnewydd"},301,"-","-","N/A","N/A",{"v":19043.113999999998,"d":"19,043"},{"v":159297.770197,"d":"159,298"},{"v":2079.9622,"d":"2,080"},{"v":19058.87083,"d":"19,059"},{"v":29322.303945,"d":"29,322"},{"v":10508.560071,"d":"10,509"},{"v":19003.334866,"d":"19,003"},{"v":125847.262025,"d":"125,847"},{"v":5581.755139000001,"d":"5,582"},{"v":37220.683531,"d":"37,221"},{"v":94486.29488900001,"d":"94,486"},{"v":122077.086669,"d":"122,077"},{"v":122053.336781,"d":"122,053"},{"v":37244.43341899999,"d":"37,244"},{"v":3472.394349,"d":"3,472"},{"v":99942.82435600004,"d":"99,943"},{"v":156447,"d":"156,447"},{"v":120851,"d":"120,851"},{"v":26654,"d":"26,654"},null,{"v":754568,"d":"754,568"},{"v":0,"d":"0.0"},145,{"v":4520,"d":"4,520"},{"v":1740,"d":"1,740"},{"v":20175,"d":"20,175"},{"v":1553,"d":"1,553"},{"v":12553,"d":"12,553"},{"v":12396582,"d":"12,396,582"},"N/A",509,{"v":1698.038146400505,"d":"1,698"},{"v":3879.9599378079147,"d":"3,880"},{"v":5860,"d":"5,860"},{"v":5660,"d":"5,660"},{"v":5450,"d":"5,450"},{"v":5345,"d":"5,345"},{"v":5370,"d":"5,370"},{"v":5290,"d":"5,290"},{"v":4975,"d":"4,975"},{"v":4855,"d":"4,855"},{"v":4685,"d":"4,685"},{"v":4605,"d":"4,605"},{"v":4630,"d":"4,630"},727,691,641,612,442,374,303,297,0,0,0,0,{"v":11060,"d":"11,060"},{"v":10570,"d":"10,570"},{"v":10239,"d":"10,239"},{"v":10284,"d":"10,284"},740,698,646,620,446,381,310,307,{"v":3994,"d":"3,994"},{"v":3962,"d":"3,962"},{"v":3923,"d":"3,923"},{"v":3864,"d":"3,864"},{"v":11236,"d":"11,236"},{"v":10768,"d":"10,768"},{"v":10442,"d":"10,442"},{"v":10494,"d":"10,494"},0,0,0,0,82,83,80,75,{"v":7937,"d":"7,937"},{"v":8060,"d":"8,060"},{"v":8234,"d":"8,234"},{"v":8427,"d":"8,427"},{"v":3994,"d":"3,994"},{"v":3962,"d":"3,962"},{"v":3923,"d":"3,923"},{"v":3864,"d":"3,864"},{"v":5180,"d":"5,180"},{"v":5041,"d":"5,041"},{"v":4879,"d":"4,879"},{"v":4791,"d":"4,791"},{"v":70160,"d":"70,160"},{"v":50.6,"d":"50.60"},{"v":196,"d":"196.00"},{"v":461.5,"d":"461.50"},{"v":21.4,"d":"21.40"},{"v":77.9,"d":"77.90"},{"v":461.2,"d":"461.20"}]
[138,23,{"$f":"IF('iaith - language'!$K$1=2,VLOOKUP(A30,Text!$A$3:$C$353,2,FALSE),VLOOKUP(A30,Text!$A$3:$C$353,3,FALSE))","v":"Caerdydd"},774,698,599,"N/A","N/A",{"v":14230.363,"d":"14,230"},{"v":369121.899908,"d":"369,122"},{"v":3975.630234,"d":"3,976"},{"v":37942.535754,"d":"37,943"},{"v":59771.662408,"d":"59,772"},{"v":22129.016061000002,"d":"22,129"},{"v":52201.999239000004,"d":"52,202"},{"v":301607.67539,"d":"301,608"},{"v":13027.977205000001,"d":"13,028"},{"v":75979.575056,"d":"75,980"},{"v":238552.123492,"d":"238,552"},{"v":293142.324853,"d":"293,142"},{"v":295781.114096,"d":"295,781"},{"v":73340.78581300001,"d":"73,341"},{"v":7342.575892,"d":"7,343"},{"v":250389.3465089999,"d":"250,389"},{"v":369202,"d":"369,202"},{"v":293830,"d":"293,830"},{"v":52807,"d":"52,807"},null,{"v":139318,"d":"139,318"},2.4,59,{"v":12820,"d":"12,820"},{"v":4090,"d":"4,090"},{"v":42578,"d":"42,578"},{"v":3039,"d":"3,039"},{"v":29825,"d":"29,825"},{"v":34141280.83,"d":"34,141,281"},"N/A",186,{"v":4804.700708592607,"d":"4,805"},{"v":19296.17765924512,"d":"19,296"},{"v":11585,"d":"11,585"},{"v":11210,"d":"11,210"},{"v":10805,"d":"10,805"},{"v":10705,"d":"10,705"},{"v":10830,"d":"10,830"},{"v":10595,"d":"10,595"},{"v":9695,"d":"9,695"},{"v":9365,"d":"9,365"},{"v":9295,"d":"9,295"},{"v":9195,"d":"9,195"},{"v":9475,"d":"9,475"},{"v":1609,"d":"1,609"},{"v":1504,"d":"1,504"},{"v":1402,"d":"1,402"},{"v":1328,"d":"1,328"},892,710,633,640,0,0,0,0,{"v":23360,"d":"23,360"},{"v":22079,"d":"22,079"},{"v":21144,"d":"21,144"},{"v":21343,"d":"21,343"},{"v":1628,"d":"1,628"},{"v":1526,"d":"1,526"},{"v":1413,"d":"1,413"},{"v":1342,"d":"1,342"},919,735,654,665,{"v":7837,"d":"7,837"},{"v":7759,"d":"7,759"},{"v":7683,"d":"7,683"},{"v":7595,"d":"7,595"},{"v":23742,"d":"23,742"},{"v":22495,"d":"22,495"},{"v":21595,"d":"21,595"},{"v":21823,"d":"21,823"},0,0,0,0,231,221,220,211,{"v":15573,"d":"15,573"},{"v":15847,"d":"15,847"},{"v":16218,"d":"16,218"},{"v":16571,"d":"16,571"},{"v":7837,"d":"7,837"},{"v":7759,"d":"7,759"},{"v":7683,"d":"7,683"},{"v":7595,"d":"7,595"},{"v":10384,"d":"10,384"},{"v":10020,"d":"10,020"},{"v":9750,"d":"9,750"},{"v":9602,"d":"9,602"},{"v":162120,"d":"162,120"},{"v":92.2,"d":"92.20"},{"v":138.3,"d":"138.30"},{"v":888.4,"d":"888.40"},{"v":58.5,"d":"58.50"},{"v":97.89999999999999,"d":"97.90"},{"v":877.5,"d":"877.50"}]
[]
[139,null,{"$f":"IF('iaith - language'!$K$1=2,VLOOKUP(A32,Text!$A$3:$C$353,2,FALSE),VLOOKUP(A32,Text!$A$3:$C$353,3,FALSE))","v":"Cyfanswm AU "},{"$f":"SUM(D9:D31)","v":{"v":7148,"d":"7,148"}},{"$f":"SUM(E9:E31)","v":{"v":6088,"d":"6,088"}},{"$f":"SUM(F9:F31)","v":{"v":5706,"d":"5,706"}},{"$f":"SUM(G9:G31)","v":0},{"$f":"SUM(H9:H30)","v":0},{"$f":"SUM(I9:I31)","v":{"v":2078263.4849999994,"d":"2,078,263"}},{"$f":"SUM(J9:J30)","v":{"v":3179106.543698,"d":"3,179,107"}},{"v":33440.99620000001,"d":"33,441"},{"v":317103.98829400004,"d":"317,104"},{"v":506761.8198580001,"d":"506,762"},{"v":190839.36162799998,"d":"190,839"},{"v":375138.816961536,"d":"375,139"},{"v":2612421.7758372948,"d":"2,612,422"},{"v":109459.360275,"d":"109,459"},{"v":640349.7064488877,"d":"640,350"},{"v":1848115.7668819297,"d":"1,848,116"},{"v":2538756.8373391116,"d":"2,538,757"},{"v":2276228.0112408176,"d":"2,276,228"},{"v":902878.5325471825,"d":"902,879"},{"v":87604.92865,"d":"87,605"},{"v":1961185.0102639296,"d":"1,961,185"},{"v":3169586,"d":"3,169,586"},{"v":2539714,"d":"2,539,714"},{"v":668590,"d":"668,590"},0,{"v":1209887,"d":"1,209,887"},{"v":117.61200000000001,"d":"117.61"},{"$f":"SUM(AE9:AE30)","v":{"v":18677,"d":"18,677"}},{"$f":"SUM(AF9:AF30)","v":{"v":115840,"d":"115,840"}},{"$f":"SUM(AG9:AG30)","v":{"v":42510,"d":"42,510"}},{"$f":"SUM(AH9:AH30)","v":{"v":398030,"d":"398,030"}},{"v":36135,"d":"36,135"},{"v":267625,"d":"267,625"},{"v":293991416.44100004,"d":"293,991,416"},{"$f":"SUM(AL9:AL30)","v":0},{"v":6116,"d":"6,116"},{"v":107899.93742501315,"d":"107,900"},{"v":71087.85909952383,"d":"71,088"},{"v":81345,"d":"81,345"},{"v":78845,"d":"78,845"},{"v":76620,"d":"76,620"},{"v":75995,"d":"75,995"},{"v":75920,"d":"75,920"},{"v":73255,"d":"73,255"},{"v":68000,"d":"68,000"},{"v":65670,"d":"65,670"},{"v":64285,"d":"64,285"},{"$f":"SUM(AY9:AY30)","v":{"v":63030,"d":"63,030"}},{"$f":"SUM(AZ9:AZ30)","v":{"v":63905,"d":"63,905"}},{"v":13815,"d":"13,815"},{"v":12924,"d":"12,924"},{"v":12018,"d":"12,018"},{"v":11349,"d":"11,349"},{"v":7393,"d":"7,393"},{"v":5867,"d":"5,867"},{"v":4952,"d":"4,952"},{"v":4749,"d":"4,749"},0,0,0,0,{"v":171702,"d":"171,702"},{"v":164402,"d":"164,402"},{"v":159764,"d":"159,764"},{"v":162044,"d":"162,044"},{"v":13986,"d":"13,986"},{"v":13090,"d":"13,090"},{"v":12169,"d":"12,169"},{"v":11510,"d":"11,510"},{"v":7635,"d":"7,635"},{"v":6074,"d":"6,074"},{"v":5127,"d":"5,127"},{"v":4933,"d":"4,933"},{"v":86757,"d":"86,757"},{"v":85849,"d":"85,849"},{"v":84639,"d":"84,639"},{"v":83413,"d":"83,413"},{"v":175434,"d":"175,434"},{"v":168348,"d":"168,348"},{"v":163821,"d":"163,821"},{"v":166260,"d":"166,260"},0,0,0,0,{"v":2448,"d":"2,448"},{"v":2422,"d":"2,422"},{"v":2373,"d":"2,373"},{"v":2334,"d":"2,334"},{"v":153924,"d":"153,924"},{"v":156182,"d":"156,182"},{"v":158981,"d":"158,981"},{"$f":"SUM(CR9:CR30)","v":{"v":162397,"d":"162,397"}},{"v":86748,"d":"86,748"},{"v":85841,"d":"85,841"},{"$f":"SUM(CU9:CU30)","v":{"v":84627,"d":"84,627"}},{"v":83407,"d":"83,407"},{"v":108378,"d":"108,378"},{"v":105013,"d":"105,013"},{"v":101935,"d":"101,935"},{"v":99856,"d":"99,856"},{"$f":"SUM(DA9:DA30)","v":{"v":1462670,"d":"1,462,670"}},{"$f":"SUM(DB9:DB30)","v":{"v":2772.999999999999,"d":"2,773.00"}},{"$f":"SUM(DC9:DC30)","v":{"v":12879.500000000002,"d":"12,879.50"}},{"v":17756.5,"d":"17,756.50"},{"v":961.1,"d":"961.10"},{"v":2144.2,"d":"2,144.20"},{"v":8826.899999999998,"d":"8,826.90"}]
[]
[]
[null,27,null,{"$f":"IF('iaith - language'!K1=2,VLOOKUP(B35,Text!$A$3:$C$353,2),VLOOKUP(B35,Text!$A$3:$C$353,3))","v":"Yr Is-adran Polisi Cyllid Llywodraeth Leol a Chynaliadwyedd, Llywodraeth Cymru"}]
[null,30,null,{"$f":"IF('iaith - language'!K1=2,VLOOKUP(B36,Text!$A$3:$C$353,2),VLOOKUP(B36,Text!$A$3:$C$353,3))","v":"Os oes gennych ymholiadau, cysylltwch â:"}]
[null,29,null,"LGFPSettlement@Gov.Wales"]
[]
[null,33,null,{"$f":"IF('iaith - language'!K1=2,VLOOKUP(B39,Text!$A$3:$C$353,2),VLOOKUP(B39,Text!$A$3:$C$353,3))","v":"Nodiadau:"}]
[null,34,null,{"$f":"IF('iaith - language'!K1=2,VLOOKUP(B40,Text!$A$3:$C$353,2),VLOOKUP(B40,Text!$A$3:$C$353,3))","v":"1 Caiff y set ddata hon ei chymryd fel cyfartaledd 3 blynedd yn y setliad."}]
[null,273]

{"sheet":"2022-23 Settlement data","index":4,"n_rows":41,"n_cols":111,"rows_kept":41,"merged":[[5,3,5,6],[5,41,5,51],[5,52,5,55],[5,56,5,59],[5,60,5,63],[5,64,5,67],[5,68,5,71],[5,72,5,75],[5,76,5,79],[5,80,5,83],[5,84,5,87],[5,88,5,91],[5,92,5,95],[5,96,5,99],[5,100,5,103]]}
[null,300,{"$f":"IF('iaith - language'!$K$1=2,VLOOKUP(B1,Text!$A$1:$C$353,2,FALSE),VLOOKUP(B1,Text!$A$1:$C$353,3,FALSE))","v":"Data a ddefnyddiwyd yn Setliad 2022-23 – er gwybodaeth yn unig"}]
[]
[{"$nulls":3},51,{"$nulls":3},61,62,67,68,69,70,71,72,73,74,75,76,77,78,79,80,81,82,83,84,86,90,91,92,145,147,143,149,151,152,152.5,160,162,163,192,{"$nulls":10},194,{"$nulls":3},195,{"$nulls":3},196,{"$nulls":3},197,{"$nulls":3},198,{"$nulls":3},199,{"$nulls":3},200,{"$nulls":3},201,{"$nulls":3},202,{"$nulls":3},203,{"$nulls":3},204,{"$nulls":3},205,{"$nulls":3},206,{"$nulls":3},271.5,53,55,57,54,56,58]
[{"$nulls":3},301,{"$f":"D4+1","v":302},{"$f":"E4+1","v":303},304,305,305,{"$nulls":20},305,null,304,304,306,{"$nulls":7},307,{"$f":"AP4+1","v":308},{"$f":"AQ4+1","v":309},310,311,304,306,305,312,{"$f":"AX4+1","v":313},314,315,316,{"$f":"AQ4","v":308},{"$f":"AT4","v":311},{"$f":"BA4","v":315},{"$f":"BB4","v":316},308,311,{"$f":"BE4","v":315},{"$f":"BF4","v":316},{"$f":"BG4","v":308},{"$f":"BH4","v":311},{"$f":"BI4","v":315},{"$f":"BJ4","v":316},{"$f":"BK4","v":308},{"$f":"BL4","v":311},{"$f":"BM4","v":315},{"$f":"BN4","v":316},{"$f":"BO4","v":308},{"$f":"BP4","v":311},{"$f":"BQ4","v":315},{"$f":"BR4","v":316},{"$f":"BS4","v":308},{"$f":"BT4","v":311},{"$f":"BU4","v":315},{"$f":"BV4","v":316},{"$f":"BW4","v":308},{"$f":"BX4","v":311},{"$f":"BY4","v":315},{"$f":"BZ4","v":316},{"$f":"CA4","v":308},{"$f":"CB4","v":311},{"$f":"CC4","v":315},{"$f":"CD4","v":316},{"$f":"CE4","v":308},{"$f":"CF4","v":311},{"$f":"CG4","v":315},{"$f":"CH4","v":316},{"$f":"CI4","v":308},{"$f":"CJ4","v":311},{"$f":"CK4","v":315},{"$f":"CL4","v":316},{"$f":"CM4","v":308},{"$f":"CN4","v":311},{"$f":"CO4","v":315},{"$f":"CP4","v":316},{"$f":"CQ4","v":308},{"$f":"CR4","v":311},{"$f":"CS4","v":315},{"$f":"CT4","v":316},{"$f":"CU4","v":308},{"$f":"CV4","v":311},{"$f":"G4","v":304},304,304,304,304,304,304]
[]
[{"$nulls":3},{"$f":"IF('iaith - language'!$K$1=2,VLOOKUP(D3,Text!$A$3:$C$353,2,FALSE),VLOOKUP(D3,Text!$A$3:$C$353,3,FALSE))","v":"Ceisiadau Cynllunio a Gafwyd"},{"$nulls":3},{"$f":"IF('iaith - language'!$K$1=2,VLOOKUP(H3,Text!$A$3:$C$353,2,FALSE),VLOOKUP(H3,Text!$A$3:$C$353,3,FALSE))","v":"Stoc anheddau'r sector preifat"},{"$f":"IF('iaith - language'!$K$1=2,VLOOKUP(I3,Text!$A$3:$C$353,2,FALSE),VLOOKUP(I3,Text!$A$3:$C$353,3,FALSE))","v":"Arwynebedd tir (hectarau)"},{"$f":"IF('iaith - language'!$K$1=2,VLOOKUP(J3,Text!$A$3:$C$353,2,FALSE),VLOOKUP(J3,Text!$A$3:$C$353,3,FALSE))","v":"Cyfanswm y boblogaeth (amcanestyniad)"},{"$f":"IF('iaith - language'!$K$1=2,VLOOKUP(K3,Text!$A$3:$C$353,2,FALSE),VLOOKUP(K3,Text!$A$3:$C$353,3,FALSE))","v":"Poblogaeth 3 oed (amcanestyniad)"},{"$f":"IF('iaith - language'!$K$1=2,VLOOKUP(L3,Text!$A$3:$C$353,2,FALSE),VLOOKUP(L3,Text!$A$3:$C$353,3,FALSE))","v":"Poblogaeth 3 i 11 oed (amcanestyniad)"},{"$f":"IF('iaith - language'!$K$1=2,VLOOKUP(M3,Text!$A$3:$C$353,2,FALSE),VLOOKUP(M3,Text!$A$3:$C$353,3,FALSE))","v":"Poblogaeth 3 i 16 oed (amcanestyniad)"},{"$f":"IF('iaith - language'!$K$1=2,VLOOKUP(N3,Text!$A$3:$C$353,2,FALSE),VLOOKUP(N3,Text!$A$3:$C$353,3,FALSE))","v":"Poblogaeth 11 i 15 oed (amcanestyniad)"},{"$f":"IF('iaith - language'!$K$1=2,VLOOKUP(O3,Text!$A$3:$C$353,2,FALSE),VLOOKUP(O3,Text!$A$3:$C$353,3,FALSE))","v":"Poblogaeth 11 i 20 oed (amcanestyniad)"},{"$f":"IF('iaith - language'!$K$1=2,VLOOKUP(P3,Text!$A$3:$C$353,2,FALSE),VLOOKUP(P3,Text!$A$3:$C$353,3,FALSE))","v":"Poblogaeth 16 oed a throsodd (amcanestyniad)"},{"$f":"IF('iaith - language'!$K$1=2,VLOOKUP(Q3,Text!$A$3:$C$353,2,FALSE),VLOOKUP(Q3,Text!$A$3:$C$353,3,FALSE))","v":"Poblogaeth 16 i 18 oed (amcanestyniad)"},{"$f":"IF('iaith - language'!$K$1=2,VLOOKUP(R3,Text!$A$3:$C$353,2,FALSE),VLOOKUP(R3,Text!$A$3:$C$353,3,FALSE))","v":"Poblogaeth 0 i 17 oed (amcanestyniad)"},{"$f":"IF('iaith - language'!$K$1=2,VLOOKUP(S3,Text!$A$3:$C$353,2,FALSE),VLOOKUP(S3,Text!$A$3:$C$353,3,FALSE))","v":"Poblogaeth 18 i 64 oed (amcanestyniad)"},{"$f":"IF('iaith - language'!$K$1=2,VLOOKUP(T3,Text!$A$3:$C$353,2,FALSE),VLOOKUP(T3,Text!$A$3:$C$353,3,FALSE))","v":"Poblogaeth 18 oed a throsodd (amcanestyniad)"},{"$f":"IF('iaith - language'!$K$1=2,VLOOKUP(U3,Text!$A$3:$C$353,2,FALSE),VLOOKUP(U3,Text!$A$3:$C$353,3,FALSE))","v":"Poblogaeth o dan 60 oed (amcanestyniad)"},{"$f":"IF('iaith - language'!$K$1=2,VLOOKUP(V3,Text!$A$3:$C$353,2,FALSE),VLOOKUP(V3,Text!$A$3:$C$353,3,FALSE))","v":"Poblogaeth 60 oed a throsodd (amcanestyniad)"},{"$f":"IF('iaith - language'!$K$1=2,VLOOKUP(W3,Text!$A$3:$C$353,2,FALSE),VLOOKUP(W3,Text!$A$3:$C$353,3,FALSE))","v":"Poblogaeth 85 oed a throsodd (amcanestyniad)"},{"$f":"IF('iaith - language'!$K$1=2,VLOOKUP(X3,Text!$A$3:$C$353,2,FALSE),VLOOKUP(X3,Text!$A$3:$C$353,3,FALSE))","v":"Poblogaeth oedran gweithio (16-65G/B) (amcanestyniad)"},{"$f":"IF('iaith - language'!$K$1=2,VLOOKUP(Y3,Text!$A$3:$C$353,2,FALSE),VLOOKUP(Y3,Text!$A$3:$C$353,3,FALSE))","v":"Amcangyfrifon Poblogaeth Ganol Blwyddyn, pob oed"},{"$f":"IF('iaith - language'!$K$1=2,VLOOKUP(Z3,Text!$A$3:$C$353,2,FALSE),VLOOKUP(Z3,Text!$A$3:$C$353,3,FALSE))","v":"Amcangyfrifon Poblogaeth Ganol Blwyddyn, 18 oed a throsodd"},{"$f":"IF('iaith - language'!$K$1=2,VLOOKUP(AA3,Text!$A$3:$C$353,2,FALSE),VLOOKUP(AA3,Text!$A$3:$C$353,3,FALSE))","v":"Amcangyfrifon Poblogaeth Ganol Blwyddyn, 65 oed a throsodd"},{"$f":"IF('iaith - language'!$K$1=2,VLOOKUP(AB3,Text!$A$3:$C$353,2,FALSE),VLOOKUP(AB3,Text!$A$3:$C$353,3,FALSE))","v":"Swm a wariwyd ar grantiau cyfleusterau i'r anabl wedi'u cwblhau (£s)"},{"$f":"IF('iaith - language'!$K$1=2,VLOOKUP(AC3,Text!$A$3:$C$353,2,FALSE),VLOOKUP(AC3,Text!$A$3:$C$353,3,FALSE))","v":"Praeseptau Draenio Tir"},{"$f":"IF('iaith - language'!$K$1=2,VLOOKUP(AD3,Text!$A$3:$C$353,2,FALSE),VLOOKUP(AD3,Text!$A$3:$C$353,3,FALSE))","v":"Hyd yr arfordir a warchodir"},{"$f":"IF('iaith - language'!$K$1=2,VLOOKUP(AE3,Text!$A$3:$C$353,2,FALSE),VLOOKUP(AE3,Text!$A$3:$C$353,3,FALSE))","v":"Nifer y Ffermydd"},{"$f":"IF('iaith - language'!$K$1=2,VLOOKUP(AF3,Text!$A$3:$C$353,2,FALSE),VLOOKUP(AF3,Text!$A$3:$C$353,3,FALSE))","v":"Nifer yr Eiddo Masnachu"},{"$f":"IF('iaith - language'!$K$1=2,VLOOKUP(AG3,Text!$A$3:$C$353,2,FALSE),VLOOKUP(AG3,Text!$A$3:$C$353,3,FALSE))","v":"Nifer yr Eiddo Bwyd"},{"$f":"IF('iaith - language'!$K$1=2,VLOOKUP(AH3,Text!$A$3:$C$353,2,FALSE),VLOOKUP(AH3,Text!$A$3:$C$353,3,FALSE))","v":"Cyfanswm yr unedau goleuadau stryd"},{"$f":"IF('iaith - language'!$K$1=2,VLOOKUP(AI3,Text!$A$3:$C$353,2,FALSE),VLOOKUP(AI3,Text!$A$3:$C$353,3,FALSE))","v":"Nifer y marwolaethau wedi'u cofrestru"},{"$f":"IF('iaith - language'!$K$1=2,VLOOKUP(AJ3,Text!$A$3:$C$353,2,FALSE),VLOOKUP(AJ3,Text!$A$3:$C$353,3,FALSE))","v":"Llwyth achosion Cynlluniau Gostyngiadau'r Dreth Gyngor "},{"$f":"IF('iaith - language'!$K$1=2,VLOOKUP(AK3,Text!$A$3:$C$353,2,FALSE),VLOOKUP(AK3,Text!$A$3:$C$353,3,FALSE))","v":"Gwariant Cynlluniau Gostyngiadau'r Dreth Gyngor"},{"$f":"IF('iaith - language'!$K$1=2,VLOOKUP(AL3,Text!$A$3:$C$353,2,FALSE),VLOOKUP(AL3,Text!$A$3:$C$353,3,FALSE))","v":"Cefnogaeth CTRS Covid-19 "},{"$f":"IF('iaith - language'!$K$1=2,VLOOKUP(AM3,Text!$A$3:$C$353,2,FALSE),VLOOKUP(AM3,Text!$A$3:$C$353,3,FALSE))","v":"Nifer y llongau sy'n cyrraedd porthladdoedd"},{"$f":"IF('iaith - language'!$K$1=2,VLOOKUP(AN3,Text!$A$3:$C$353,2,FALSE),VLOOKUP(AN3,Text!$A$3:$C$353,3,FALSE))","v":"Nosweithiau twristiaid (miloedd) gan gynnwys AirBnb"},{"$f":"IF('iaith - language'!$K$1=2,VLOOKUP(AO3,Text!$A$3:$C$353,2,FALSE),VLOOKUP(AO3,Text!$A$3:$C$353,3,FALSE))","v":"Diwrnodau twristiaid (miloedd)"},{"$f":"IF('iaith - language'!$K$1=2,VLOOKUP(AP3,Text!$A$3:$C$353,2,FALSE),VLOOKUP(AP3,Text!$A$3:$C$353,3,FALSE))","v":"Data Hawlwyr Budd-dal "},{"$nulls":10},{"$f":"IF('iaith - language'!$K$1=2,VLOOKUP(BA3,Text!$A$3:$C$353,2,FALSE),VLOOKUP(BA3,Text!$A$3:$C$353,3,FALSE))","v":"Nifer yr Hawlwyr Cymhorthdal Incwm, 18-64 oed"},{"$nulls":3},{"$f":"IF('iaith - language'!$K$1=2,VLOOKUP(BE3,Text!$A$3:$C$353,2,FALSE),VLOOKUP(BE3,Text!$A$3:$C$353,3,FALSE))","v":"Nifer y Derbynwyr Lwfans Ceisio Swydd ar Sail Incwm, 18-64 oed"},{"$nulls":3},{"$f":"IF('iaith - language'!$K$1=2,VLOOKUP(BI3,Text!$A$3:$C$353,2,FALSE),VLOOKUP(BI3,Text!$A$3:$C$353,3,FALSE))","v":"Nifer yr hawlwyr Credyd Pensiwn, 18-64 oed"},{"$nulls":3},{"$f":"IF('iaith - language'!$K$1=2,VLOOKUP(BM3,Text!$A$3:$C$353,2,FALSE),VLOOKUP(BM3,Text!$A$3:$C$353,3,FALSE))","v":"Nifer y rhai sydd yn derbyn Credyd Cynhwysol (ddim mewn cyflogaeth) 18-64 oed"},{"$nulls":3},{"$f":"IF('iaith - language'!$K$1=2,VLOOKUP(BQ3,Text!$A$3:$C$353,2,FALSE),VLOOKUP(BQ3,Text!$A$3:$C$353,3,FALSE))","v":"Cyfanswm yr Hawlwyr Cymhorthdal Incwm"},{"$nulls":3},{"$f":"IF('iaith - language'!$K$1=2,VLOOKUP(BU3,Text!$A$3:$C$353,2,FALSE),VLOOKUP(BU3,Text!$A$3:$C$353,3,FALSE))","v":"Cyfanswm y Derbynwyr Lwfans Ceisio Swydd ar Sail Incwm"},{"$nulls":3},{"$f":"IF('iaith - language'!$K$1=2,VLOOKUP(BY3,Text!$A$3:$C$353,2,FALSE),VLOOKUP(BY3,Text!$A$3:$C$353,3,FALSE))","v":"Cyfanswm Hawlwyr Credyd Pensiwn"},{"$nulls":3},{"$f":"IF('iaith - language'!$K$1=2,VLOOKUP(CC3,Text!$A$3:$C$353,2,FALSE),VLOOKUP(CC3,Text!$A$3:$C$353,3,FALSE))","v":"Cyfanswm y rhai sy’n derbyn Credyd Cynhwysol (ddim mewn cyflogaeth)"},{"$nulls":3},{"$f":"IF('iaith - language'!$K$1=2,VLOOKUP(CG3,Text!$A$3:$C$353,2,FALSE),VLOOKUP(CG3,Text!$A$3:$C$353,3,FALSE))","v":"Nifer yr Hawlwyr Lwfans Anabledd Difrifol, 18-64 oed"},{"$nulls":3},{"$f":"IF('iaith - language'!$K$1=2,VLOOKUP(CK3,Text!$A$3:$C$353,2,FALSE),VLOOKUP(CK3,Text!$A$3:$C$353,3,FALSE))","v":"Nifer yr Hawlwyr Lwfans Byw i'r Anabl, 18-64 oed"},{"$nulls":3},{"$f":"IF('iaith - language'!$K$1=2,VLOOKUP(CO3,Text!$A$3:$C$353,2,FALSE),VLOOKUP(CO3,Text!$A$3:$C$353,3,FALSE))","v":"Nifer yr Hawlwyr Taliad Annibyniaeth Bersonol sydd yn 18-64 oed"},{"$nulls":3},{"$f":"IF('iaith - language'!$K$1=2,VLOOKUP(CS3,Text!$A$3:$C$353,2,FALSE),VLOOKUP(CS3,Text!$A$3:$C$353,3,FALSE))","v":"Hawlwyr Credyd Pensiwn, 65 oed a hŷn "},{"$nulls":3},{"$f":"IF('iaith - language'!$K$1=2,VLOOKUP(CW3,Text!$A$3:$C$353,2,FALSE),VLOOKUP(CW3,Text!$A$3:$C$353,3,FALSE))","v":"Cyfanswn yr hawlwyr Cymhorthdal Incwm, Lwfans Ceisio Gwaith, a Chredyd Pensiwn"},{"$nulls":3},{"$f":"IF('iaith - language'!$K$1=2,VLOOKUP(DA3,Text!$A$3:$C$353,2,FALSE),VLOOKUP(DA3,Text!$A$3:$C$353,3,FALSE))","v":"Stoc eiddo treth cyngor"},{"$f":"IF('iaith - language'!$K$1=2,VLOOKUP(DB3,Text!$A$3:$C$353,2,FALSE),VLOOKUP(DB3,Text!$A$3:$C$353,3,FALSE))","v":"Hyd ffyrdd A y sir (km)"},{"$f":"IF('iaith - language'!$K$1=2,VLOOKUP(DC3,Text!$A$3:$C$353,2,FALSE),VLOOKUP(DC3,Text!$A$3:$C$353,3,FALSE))","v":"Hyd ffyrdd B ac C (km)"},{"$f":"IF('iaith - language'!$K$1=2,VLOOKUP(DD3,Text!$A$3:$C$353,2,FALSE),VLOOKUP(DD3,Text!$A$3:$C$353,3,FALSE))","v":"Hyd is-ffyrdd â wyneb caled (km)"},{"$f":"IF('iaith - language'!$K$1=2,VLOOKUP(DE3,Text!$A$3:$C$353,2,FALSE),VLOOKUP(DE3,Text!$A$3:$C$353,3,FALSE))","v":"Hyd ffyrdd A y sir, adeiledig (km)"},{"$f":"IF('iaith - language'!$K$1=2,VLOOKUP(DF3,Text!$A$3:$C$353,2,FALSE),VLOOKUP(DF3,Text!$A$3:$C$353,3,FALSE))","v":"Hyd ffyrdd B ac C, adeiledig (km)"},{"$f":"IF('iaith - language'!$K$1=2,VLOOKUP(DG3,Text!$A$3:$C$353,2,FALSE),VLOOKUP(DG3,Text!$A$3:$C$353,3,FALSE))","v":"Hyd is-ffyrdd â wyneb caled, adeiledig (km)"}]
[null,0,null,{"$f":"IF('iaith - language'!$K$1=2,VLOOKUP(D$4,Text!$A$3:$C$458,2,FALSE),VLOOKUP(D$4,Text!$A$3:$C$458,3,FALSE))","v":"Mehefin 2020"},{"$f":"IF('iaith - language'!$K$1=2,VLOOKUP(E$4,Text!$A$3:$C$458,2,FALSE),VLOOKUP(E$4,Text!$A$3:$C$458,3,FALSE))","v":"Medi 2020"},{"$f":"IF('iaith - language'!$K$1=2,VLOOKUP(F$4,Text!$A$3:$C$458,2,FALSE),VLOOKUP(F$4,Text!$A$3:$C$458,3,FALSE))","v":"Rhagfyr 2020"},{"$f":"IF('iaith - language'!$K$1=2,VLOOKUP(G$4,Text!$A$3:$C$458,2,FALSE),VLOOKUP(G$4,Text!$A$3:$C$458,3,FALSE))","v":"Mawrth 2021"},"2019-20",{"$f":"IF('iaith - language'!$K$1=2,VLOOKUP(I$4,Text!$A$1:$C$458,2,FALSE),VLOOKUP(I$4,Text!$A$1:$C$458,3,FALSE))","v":"Mai 2021"},2022,2022,{"$f":"K7","v":2022},{"$f":"L7","v":2022},2022,2022,2022,2022,2022,2022,2022,2022,2022,2022,2022,2020,2020,2020,"2018-19","2021-22",{"$f":"IF('iaith - language'!$K$1=2,VLOOKUP(AD$4,Text!$A$1:$C$458,2,FALSE),VLOOKUP(AD$4,Text!$A$1:$C$458,3,FALSE))","v":"Mai 2021"},2020,{"$f":"IF('iaith - language'!$K$1=2,VLOOKUP(AF$4,Text!$A$1:$C$458,2,FALSE),VLOOKUP(AF$4,Text!$A$1:$C$458,3,FALSE))","v":"Mawrth 2021"},{"$f":"IF('iaith - language'!$K$1=2,VLOOKUP(AG$4,Text!$A$1:$C$458,2,FALSE),VLOOKUP(AG$4,Text!$A$1:$C$458,3,FALSE))","v":"Mawrth 2021"},{"$f":"IF('iaith - language'!$K$1=2,VLOOKUP(AH$4,Text!$A$1:$C$458,2,FALSE),VLOOKUP(AH$4,Text!$A$1:$C$458,3,FALSE))","v":"Ebrill 2021"},2020,"2020-21","2020-21","2020-21",2020,2019,2019,{"$f":"IF('iaith - language'!$K$1=2,VLOOKUP(AP$4,Text!$A$1:$C$458,2,FALSE),VLOOKUP(AP$4,Text!$A$1:$C$458,3,FALSE))","v":"Hydref 2020"},{"$f":"IF('iaith - language'!$K$1=2,VLOOKUP(AQ$4,Text!$A$1:$C$458,2,FALSE),VLOOKUP(AQ$4,Text!$A$1:$C$458,3,FALSE))","v":"Tachwedd 2020"},{"$f":"IF('iaith - language'!$K$1=2,VLOOKUP(AR$4,Text!$A$1:$C$458,2,FALSE),VLOOKUP(AR$4,Text!$A$1:$C$458,3,FALSE))","v":"Rhagfyr 2020"},{"$f":"IF('iaith - language'!$K$1=2,VLOOKUP(AS$4,Text!$A$1:$C$458,2,FALSE),VLOOKUP(AS$4,Text!$A$1:$C$458,3,FALSE))","v":"Ionawr 2021"},{"$f":"IF('iaith - language'!$K$1=2,VLOOKUP(AT$4,Text!$A$1:$C$458,2,FALSE),VLOOKUP(AT$4,Text!$A$1:$C$458,3,FALSE))","v":"Chwefror 2021"},{"$f":"IF('iaith - language'!$K$1=2,VLOOKUP(AU$4,Text!$A$1:$C$458,2,FALSE),VLOOKUP(AU$4,Text!$A$1:$C$458,3,FALSE))","v":"Mawrth 2021"},{"$f":"IF('iaith - language'!$K$1=2,VLOOKUP(AV$4,Text!$A$1:$C$458,2,FALSE),VLOOKUP(AV$4,Text!$A$1:$C$458,3,FALSE))","v":"Ebrill 2021"},{"$f":"IF('iaith - language'!$K$1=2,VLOOKUP(AW$4,Text!$A$1:$C$458,2,FALSE),VLOOKUP(AW$4,Text!$A$1:$C$458,3,FALSE))","v":"Mai 2021"},{"$f":"IF('iaith - language'!$K$1=2,VLOOKUP(AX$4,Text!$A$1:$C$458,2,FALSE),VLOOKUP(AX$4,Text!$A$1:$C$458,3,FALSE))","v":"Mehefin 2021"},{"$f":"IF('iaith - language'!$K$1=2,VLOOKUP(AY$4,Text!$A$1:$C$458,2,FALSE),VLOOKUP(AY$4,Text!$A$1:$C$458,3,FALSE))","v":"Gorffennaf 2021"},{"$f":"IF('iaith - language'!$K$1=2,VLOOKUP(AZ$4,Text!$A$1:$C$458,2,FALSE),VLOOKUP(AZ$4,Text!$A$1:$C$458,3,FALSE))","v":"Awst 2021"},{"$f":"IF('iaith - language'!$K$1=2,VLOOKUP(BA$4,Text!$A$1:$C$458,2,FALSE),VLOOKUP(BA$4,Text!$A$1:$C$458,3,FALSE))","v":"Mai 2020"},{"$f":"IF('iaith - language'!$K$1=2,VLOOKUP(BB$4,Text!$A$1:$C$458,2,FALSE),VLOOKUP(BB$4,Text!$A$1:$C$458,3,FALSE))","v":"Awst 2020"},{"$f":"IF('iaith - language'!$K$1=2,VLOOKUP(BC$4,Text!$A$1:$C$458,2,FALSE),VLOOKUP(BC$4,Text!$A$1:$C$458,3,FALSE))","v":"Tachwedd 2020"},{"$f":"IF('iaith - language'!$K$1=2,VLOOKUP(BD$4,Text!$A$1:$C$458,2,FALSE),VLOOKUP(BD$4,Text!$A$1:$C$458,3,FALSE))","v":"Chwefror 2021"},{"$f":"IF('iaith - language'!$K$1=2,VLOOKUP(BE$4,Text!$A$1:$C$458,2,FALSE),VLOOKUP(BE$4,Text!$A$1:$C$458,3,FALSE))","v":"Mai 2020"},{"$f":"IF('iaith - language'!$K$1=2,VLOOKUP(BF$4,Text!$A$1:$C$458,2,FALSE),VLOOKUP(BF$4,Text!$A$1:$C$458,3,FALSE))","v":"Awst 2020"},{"$f":"IF('iaith - language'!$K$1=2,VLOOKUP(BG$4,Text!$A$1:$C$458,2,FALSE),VLOOKUP(BG$4,Text!$A$1:$C$458,3,FALSE))","v":"Tachwedd 2020"},{"$f":"IF('iaith - language'!$K$1=2,VLOOKUP(BH$4,Text!$A$1:$C$458,2,FALSE),VLOOKUP(BH$4,Text!$A$1:$C$458,3,FALSE))","v":"Chwefror 2021"},{"$f":"IF('iaith - language'!$K$1=2,VLOOKUP(BI$4,Text!$A$1:$C$458,2,FALSE),VLOOKUP(BI$4,Text!$A$1:$C$458,3,FALSE))","v":"Mai 2020"},{"$f":"IF('iaith - language'!$K$1=2,VLOOKUP(BJ$4,Text!$A$1:$C$458,2,FALSE),VLOOKUP(BJ$4,Text!$A$1:$C$458,3,FALSE))","v":"Awst 2020"},{"$f":"IF('iaith - language'!$K$1=2,VLOOKUP(BK$4,Text!$A$1:$C$458,2,FALSE),VLOOKUP(BK$4,Text!$A$1:$C$458,3,FALSE))","v":"Tachwedd 2020"},{"$f":"IF('iaith - language'!$K$1=2,VLOOKUP(BL$4,Text!$A$1:$C$458,2,FALSE),VLOOKUP(BL$4,Text!$A$1:$C$458,3,FALSE))","v":"Chwefror 2021"},{"$f":"IF('iaith - language'!$K$1=2,VLOOKUP(BM$4,Text!$A$1:$C$458,2,FALSE),VLOOKUP(BM$4,Text!$A$1:$C$458,3,FALSE))","v":"Mai 2020"},{"$f":"IF('iaith - language'!$K$1=2,VLOOKUP(BN$4,Text!$A$1:$C$458,2,FALSE),VLOOKUP(BN$4,Text!$A$1:$C$458,3,FALSE))","v":"Awst 2020"},{"$f":"IF('iaith - language'!$K$1=2,VLOOKUP(BO$4,Text!$A$1:$C$458,2,FALSE),VLOOKUP(BO$4,Text!$A$1:$C$458,3,FALSE))","v":"Tachwedd 2020"},{"$f":"IF('iaith - language'!$K$1=2,VLOOKUP(BP$4,Text!$A$1:$C$458,2,FALSE),VLOOKUP(BP$4,Text!$A$1:$C$458,3,FALSE))","v":"Chwefror 2021"},{"$f":"IF('iaith - language'!$K$1=2,VLOOKUP(BQ$4,Text!$A$1:$C$458,2,FALSE),VLOOKUP(BQ$4,Text!$A$1:$C$458,3,FALSE))","v":"Mai 2020"},{"$f":"IF('iaith - language'!$K$1=2,VLOOKUP(BR$4,Text!$A$1:$C$458,2,FALSE),VLOOKUP(BR$4,Text!$A$1:$C$458,3,FALSE))","v":"Awst 2020"},{"$f":"IF('iaith - language'!$K$1=2,VLOOKUP(BS$4,Text!$A$1:$C$458,2,FALSE),VLOOKUP(BS$4,Text!$A$1:$C$458,3,FALSE))","v":"Tachwedd 2020"},{"$f":"IF('iaith - language'!$K$1=2,VLOOKUP(BT$4,Text!$A$1:$C$458,2,FALSE),VLOOKUP(BT$4,Text!$A$1:$C$458,3,FALSE))","v":"Chwefror 2021"},{"$f":"IF('iaith - language'!$K$1=2,VLOOKUP(BU$4,Text!$A$1:$C$458,2,FALSE),VLOOKUP(BU$4,Text!$A$1:$C$458,3,FALSE))","v":"Mai 2020"},{"$f":"IF('iaith - language'!$K$1=2,VLOOKUP(BV$4,Text!$A$1:$C$458,2,FALSE),VLOOKUP(BV$4,Text!$A$1:$C$458,3,FALSE))","v":"Awst 2020"},{"$f":"IF('iaith - language'!$K$1=2,VLOOKUP(BW$4,Text!$A$1:$C$458,2,FALSE),VLOOKUP(BW$4,Text!$A$1:$C$458,3,FALSE))","v":"Tachwedd 2020"},{"$f":"IF('iaith - language'!$K$1=2,VLOOKUP(BX$4,Text!$A$1:$C$458,2,FALSE),VLOOKUP(BX$4,Text!$A$1:$C$458,3,FALSE))","v":"Chwefror 2021"},{"$f":"IF('iaith - language'!$K$1=2,VLOOKUP(BY$4,Text!$A$1:$C$458,2,FALSE),VLOOKUP(BY$4,Text!$A$1:$C$458,3,FALSE))","v":"Mai 2020"},{"$f":"IF('iaith - language'!$K$1=2,VLOOKUP(BZ$4,Text!$A$1:$C$458,2,FALSE),VLOOKUP(BZ$4,Text!$A$1:$C$458,3,FALSE))","v":"Awst 2020"},{"$f":"IF('iaith - language'!$K$1=2,VLOOKUP(CA$4,Text!$A$1:$C$458,2,FALSE),VLOOKUP(CA$4,Text!$A$1:$C$458,3,FALSE))","v":"Tachwedd 2020"},{"$f":"IF('iaith - language'!$K$1=2,VLOOKUP(CB$4,Text!$A$1:$C$458,2,FALSE),VLOOKUP(CB$4,Text!$A$1:$C$458,3,FALSE))","v":"Chwefror 2021"},{"$f":"IF('iaith - language'!$K$1=2,VLOOKUP(CC$4,Text!$A$1:$C$458,2,FALSE),VLOOKUP(CC$4,Text!$A$1:$C$458,3,FALSE))","v":"Mai 2020"},{"$f":"IF('iaith - language'!$K$1=2,VLOOKUP(CD$4,Text!$A$1:$C$458,2,FALSE),VLOOKUP(CD$4,Text!$A$1:$C$458,3,FALSE))","v":"Awst 2020"},{"$f":"IF('iaith - language'!$K$1=2,VLOOKUP(CE$4,Text!$A$1:$C$458,2,FALSE),VLOOKUP(CE$4,Text!$A$1:$C$458,3,FALSE))","v":"Tachwedd 2020"},{"$f":"IF('iaith - language'!$K$1=2,VLOOKUP(CF$4,Text!$A$1:$C$458,2,FALSE),VLOOKUP(CF$4,Text!$A$1:$C$458,3,FALSE))","v":"Chwefror 2021"},{"$f":"IF('iaith - language'!$K$1=2,VLOOKUP(CG$4,Text!$A$1:$C$458,2,FALSE),VLOOKUP(CG$4,Text!$A$1:$C$458,3,FALSE))","v":"Mai 2020"},{"$f":"IF('iaith - language'!$K$1=2,VLOOKUP(CH$4,Text!$A$1:$C$458,2,FALSE),VLOOKUP(CH$4,Text!$A$1:$C$458,3,FALSE))","v":"Awst 2020"},{"$f":"IF('iaith - language'!$K$1=2,VLOOKUP(CI$4,Text!$A$1:$C$458,2,FALSE),VLOOKUP(CI$4,Text!$A$1:$C$458,3,FALSE))","v":"Tachwedd 2020"},{"$f":"IF('iaith - language'!$K$1=2,VLOOKUP(CJ$4,Text!$A$1:$C$458,2,FALSE),VLOOKUP(CJ$4,Text!$A$1:$C$458,3,FALSE))","v":"Chwefror 2021"},{"$f":"IF('iaith - language'!$K$1=2,VLOOKUP(CK$4,Text!$A$1:$C$458,2,FALSE),VLOOKUP(CK$4,Text!$A$1:$C$458,3,FALSE))","v":"Mai 2020"},{"$f":"IF('iaith - language'!$K$1=2,VLOOKUP(CL$4,Text!$A$1:$C$458,2,FALSE),VLOOKUP(CL$4,Text!$A$1:$C$458,3,FALSE))","v":"Awst 2020"},{"$f":"IF('iaith - language'!$K$1=2,VLOOKUP(CM$4,Text!$A$1:$C$458,2,FALSE),VLOOKUP(CM$4,Text!$A$1:$C$458,3,FALSE))","v":"Tachwedd 2020"},{"$f":"IF('iaith - language'!$K$1=2,VLOOKUP(CN$4,Text!$A$1:$C$458,2,FALSE),VLOOKUP(CN$4,Text!$A$1:$C$458,3,FALSE))","v":"Chwefror 2021"},{"$f":"IF('iaith - language'!$K$1=2,VLOOKUP(CO$4,Text!$A$1:$C$458,2,FALSE),VLOOKUP(CO$4,Text!$A$1:$C$458,3,FALSE))","v":"Mai 2020"},{"$f":"IF('iaith - language'!$K$1=2,VLOOKUP(CP$4,Text!$A$1:$C$458,2,FALSE),VLOOKUP(CP$4,Text!$A$1:$C$458,3,FALSE))","v":"Awst 2020"},{"$f":"IF('iaith - language'!$K$1=2,VLOOKUP(CQ$4,Text!$A$1:$C$458,2,FALSE),VLOOKUP(CQ$4,Text!$A$1:$C$458,3,FALSE))","v":"Tachwedd 2020"},{"$f":"IF('iaith - language'!$K$1=2,VLOOKUP(CR$4,Text!$A$1:$C$458,2,FALSE),VLOOKUP(CR$4,Text!$A$1:$C$458,3,FALSE))","v":"Chwefror 2021"},{"$f":"IF('iaith - language'!$K$1=2,VLOOKUP(CS$4,Text!$A$1:$C$458,2,FALSE),VLOOKUP(CS$4,Text!$A$1:$C$458,3,FALSE))","v":"Mai 2020"},{"$f":"IF('iaith - language'!$K$1=2,VLOOKUP(CT$4,Text!$A$1:$C$458,2,FALSE),VLOOKUP(CT$4,Text!$A$1:$C$458,3,FALSE))","v":"Awst 2020"},{"$f":"IF('iaith - language'!$K$1=2,VLOOKUP(CU$4,Text!$A$1:$C$458,2,FALSE),VLOOKUP(CU$4,Text!$A$1:$C$458,3,FALSE))","v":"Tachwedd 2020"},{"$f":"IF('iaith - language'!$K$1=2,VLOOKUP(CV$4,Text!$A$1:$C$458,2,FALSE),VLOOKUP(CV$4,Text!$A$1:$C$458,3,FALSE))","v":"Chwefror 2021"},{"$f":"IF('iaith - language'!$K$1=2,VLOOKUP(CW$4,Text!$A$1:$C$458,2,FALSE),VLOOKUP(CW$4,Text!$A$1:$C$458,3,FALSE))","v":"Mai 2020"},{"$f":"IF('iaith - language'!$K$1=2,VLOOKUP(CX$4,Text!$A$1:$C$458,2,FALSE),VLOOKUP(CX$4,Text!$A$1:$C$458,3,FALSE))","v":"Awst 2020"},{"$f":"IF('iaith - language'!$K$1=2,VLOOKUP(CY$4,Text!$A$1:$C$458,2,FALSE),VLOOKUP(CY$4,Text!$A$1:$C$458,3,FALSE))","v":"Tachwedd 2020"},{"$f":"IF('iaith - language'!$K$1=2,VLOOKUP(CZ$4,Text!$A$1:$C$458,2,FALSE),VLOOKUP(CZ$4,Text!$A$1:$C$458,3,FALSE))","v":"Chwefror 2021"},{"$f":"IF('iaith - language'!$K$1=2,VLOOKUP(DA$4,Text!$A$1:$C$458,2,FALSE),VLOOKUP(DA$4,Text!$A$1:$C$458,3,FALSE))","v":"Mawrth 2021"},{"$f":"IF('iaith - language'!$K$1=2,VLOOKUP(DB$4,Text!$A$1:$C$458,2,FALSE),VLOOKUP(DB$4,Text!$A$1:$C$458,3,FALSE))","v":"Mawrth 2021"},{"$f":"IF('iaith - language'!$K$1=2,VLOOKUP(DC$4,Text!$A$1:$C$458,2,FALSE),VLOOKUP(DC$4,Text!$A$1:$C$458,3,FALSE))","v":"Mawrth 2021"},{"$f":"IF('iaith - language'!$K$1=2,VLOOKUP(DD$4,Text!$A$1:$C$458,2,FALSE),VLOOKUP(DD$4,Text!$A$1:$C$458,3,FALSE))","v":"Mawrth 2021"},{"$f":"IF('iaith - language'!$K$1=2,VLOOKUP(DE$4,Text!$A$1:$C$458,2,FALSE),VLOOKUP(DE$4,Text!$A$1:$C$458,3,FALSE))","v":"Mawrth 2021"},{"$f":"IF('iaith - language'!$K$1=2,VLOOKUP(DF$4,Text!$A$1:$C$458,2,FALSE),VLOOKUP(DF$4,Text!$A$1:$C$458,3,FALSE))","v":"Mawrth 2021"},{"$f":"IF('iaith - language'!$K$1=2,VLOOKUP(DG$4,Text!$A$1:$C$458,2,FALSE),VLOOKUP(DG$4,Text!$A$1:$C$458,3,FALSE))","v":"Mawrth 2021"}]
[]
[117,2,{"$f":"IF('iaith - language'!$K$1=2,VLOOKUP(A9,Text!$A$3:$C$353,2,FALSE),VLOOKUP(A9,Text!$A$3:$C$353,3,FALSE))","v":"Sir Ynys Môn"},137,178,217,226,"N/A",{"v":71521.257,"d":"71,521"},{"v":69863.739896,"d":"69,864"},{"v":702.523113,"d":"703"},{"v":6826.003851,"d":"6,826"},{"v":10757.155589,"d":"10,757"},{"v":3995.7320560000003,"d":"3,996"},{"v":7080.80409,"d":"7,081"},{"v":57810.554655,"d":"57,811"},{"v":2110.618313,"d":"2,111"},{"v":13482.248694999998,"d":"13,482"},{"v":37656.140179,"d":"37,656"},{"v":56381.4912,"d":"56,381"},{"v":45838.267711,"d":"45,838"},{"v":24025.472184000006,"d":"24,025"},{"v":2298.352486,"d":"2,298"},{"v":40088.11843499999,"d":"40,088"},{"v":70440,"d":"70,440"},{"v":57101,"d":"57,101"},{"v":18639,"d":"18,639"},null,{"v":3673,"d":"3,673"},7.9,932,{"v":3320,"d":"3,320"},{"v":1030,"d":"1,030"},{"v":9978,"d":"9,978"},877,{"v":5706,"d":"5,706"},{"v":6325768.82,"d":"6,325,769"},{"v":227911.40666666688,"d":"227,911"},{"v":2811,"d":"2,811"},{"v":5514.022396125236,"d":"5,514"},{"v":707.4918435630126,"d":"707"},{"v":2355,"d":"2,355"},{"v":2400,"d":"2,400"},{"v":2350,"d":"2,350"},{"v":2310,"d":"2,310"},{"v":2390,"d":"2,390"},{"v":2380,"d":"2,380"},{"v":2330,"d":"2,330"},{"v":2205,"d":"2,205"},{"v":2045,"d":"2,045"},{"v":1955,"d":"1,955"},{"v":1870,"d":"1,870"},389,368,338,315,424,412,335,307,0,0,0,0,{"v":3167,"d":"3,167"},{"v":3234,"d":"3,234"},{"v":3191,"d":"3,191"},{"v":3356,"d":"3,356"},398,369,344,318,433,425,343,318,{"v":2364,"d":"2,364"},{"v":2344,"d":"2,344"},{"v":2310,"d":"2,310"},{"v":2270,"d":"2,270"},{"v":3109,"d":"3,109"},{"v":3176,"d":"3,176"},{"v":3123,"d":"3,123"},{"v":3265,"d":"3,265"},0,0,0,0,95,83,73,77,{"v":2688,"d":"2,688"},{"v":2725,"d":"2,725"},{"v":2755,"d":"2,755"},{"v":2751,"d":"2,751"},{"v":2364,"d":"2,364"},{"v":2344,"d":"2,344"},{"v":2310,"d":"2,310"},{"v":2270,"d":"2,270"},{"v":3195,"d":"3,195"},{"v":3138,"d":"3,138"},{"v":2997,"d":"2,997"},{"v":2906,"d":"2,906"},{"v":35260,"d":"35,260"},145.52,484.44,{"v":558.2049999999999,"d":"558.21"},28.07,{"v":59.56999999999999,"d":"59.57"},{"v":180.565,"d":"180.57"}]
[118,3,{"$f":"IF('iaith - language'!$K$1=2,VLOOKUP(A10,Text!$A$3:$C$353,2,FALSE),VLOOKUP(A10,Text!$A$3:$C$353,3,FALSE))","v":"Gwynedd"},188,214,268,282,"N/A",{"v":254829.301,"d":"254,829"},{"v":125219.625657,"d":"125,220"},{"v":1189.695154,"d":"1,190"},{"v":11611.392887,"d":"11,611"},{"v":18769.464421999997,"d":"18,769"},{"v":7105.822589,"d":"7,106"},{"v":15692.345415,"d":"15,692"},{"v":104270.213861,"d":"104,270"},{"v":4144.5394240000005,"d":"4,145"},{"v":23710.612744000005,"d":"23,711"},{"v":72709.92901699997,"d":"72,710"},{"v":101509.01291799995,"d":"101,509"},{"v":88111.051075,"d":"88,111"},{"v":37108.574587,"d":"37,109"},{"v":4060.3644339999996,"d":"4,060"},{"v":77065.57505899998,"d":"77,066"},{"v":125171,"d":"125,171"},{"v":101957,"d":"101,957"},{"v":28562,"d":"28,562"},null,{"v":118626,"d":"118,626"},{"v":20.137,"d":"20.1"},{"v":1815,"d":"1,815"},{"v":8140,"d":"8,140"},{"v":2520,"d":"2,520"},{"v":17654,"d":"17,654"},{"v":1428,"d":"1,428"},{"v":9442,"d":"9,442"},{"v":10128722.62,"d":"10,128,723"},{"v":512904.41666666605,"d":"512,904"},2,{"v":20095.71004285075,"d":"20,096"},{"v":3836.383671608743,"d":"3,836"},{"v":3730,"d":"3,730"},{"v":3805,"d":"3,805"},{"v":3875,"d":"3,875"},{"v":3930,"d":"3,930"},{"v":4145,"d":"4,145"},{"v":4045,"d":"4,045"},{"v":3880,"d":"3,880"},{"v":3430,"d":"3,430"},{"v":3065,"d":"3,065"},{"v":2925,"d":"2,925"},{"v":2715,"d":"2,715"},507,473,442,418,495,488,470,430,0,0,0,0,{"v":5336,"d":"5,336"},{"v":5340,"d":"5,340"},{"v":5147,"d":"5,147"},{"v":5713,"d":"5,713"},508,477,446,426,506,495,486,439,{"v":3921,"d":"3,921"},{"v":3867,"d":"3,867"},{"v":3806,"d":"3,806"},{"v":3742,"d":"3,742"},{"v":5230,"d":"5,230"},{"v":5227,"d":"5,227"},{"v":5044,"d":"5,044"},{"v":5584,"d":"5,584"},0,0,0,0,155,140,125,122,{"v":3671,"d":"3,671"},{"v":3737,"d":"3,737"},{"v":3777,"d":"3,777"},{"v":3840,"d":"3,840"},{"v":3921,"d":"3,921"},{"v":3867,"d":"3,867"},{"v":3806,"d":"3,806"},{"v":3742,"d":"3,742"},{"v":4935,"d":"4,935"},{"v":4839,"d":"4,839"},{"v":4738,"d":"4,738"},{"v":4607,"d":"4,607"},{"v":61490,"d":"61,490"},{"v":330.5,"d":"330.50"},{"v":1064.9,"d":"1,064.90"},{"v":1322.32,"d":"1,322.32"},{"v":71.5,"d":"71.50"},{"v":104.30000000000001,"d":"104.30"},{"v":346.9,"d":"346.90"}]
[119,4,{"$f":"IF('iaith - language'!$K$1=2,VLOOKUP(A11,Text!$A$3:$C$353,2,FALSE),VLOOKUP(A11,Text!$A$3:$C$353,3,FALSE))","v":"Conwy"},195,274,243,295,"N/A",{"v":113017.89400000001,"d":"113,018"},{"v":118320.287582,"d":"118,320"},{"v":1070.510073,"d":"1,071"},{"v":10802.66923,"d":"10,803"},{"v":17347.038385,"d":"17,347"},{"v":6579.543791,"d":"6,580"},{"v":11832.277450000001,"d":"11,832"},{"v":99145.45808000001,"d":"99,145"},{"v":3756.4425309999997,"d":"3,756"},{"v":21744.602745999997,"d":"21,745"},{"v":62852.16249699998,"d":"62,852"},{"v":96575.68483799997,"d":"96,576"},{"v":75529.051337,"d":"75,529"},{"v":42791.23624700001,"d":"42,791"},{"v":5187.875804,"d":"5,188"},{"v":67117.72796299998,"d":"67,118"},{"v":118184,"d":"118,184"},{"v":97000,"d":"97,000"},{"v":32938,"d":"32,938"},null,{"v":38951,"d":"38,951"},{"v":23.59,"d":"23.6"},928,{"v":5340,"d":"5,340"},{"v":2200,"d":"2,200"},{"v":16772,"d":"16,772"},{"v":1587,"d":"1,587"},{"v":10871,"d":"10,871"},{"v":11284903.38,"d":"11,284,903"},{"v":591653.2033333337,"d":"591,653"},50,{"v":11135.436688486161,"d":"11,135"},{"v":7219.659429750646,"d":"7,220"},{"v":4190,"d":"4,190"},{"v":4260,"d":"4,260"},{"v":4325,"d":"4,325"},{"v":4285,"d":"4,285"},{"v":4380,"d":"4,380"},{"v":4330,"d":"4,330"},{"v":4265,"d":"4,265"},{"v":4020,"d":"4,020"},{"v":3655,"d":"3,655"},{"v":3415,"d":"3,415"},{"v":3195,"d":"3,195"},596,567,548,515,620,598,519,498,0,0,0,0,{"v":6236,"d":"6,236"},{"v":6156,"d":"6,156"},{"v":5984,"d":"5,984"},{"v":6464,"d":"6,464"},598,572,550,523,634,611,534,510,{"v":4079,"d":"4,079"},{"v":4038,"d":"4,038"},{"v":4006,"d":"4,006"},{"v":3941,"d":"3,941"},{"v":6113,"d":"6,113"},{"v":6036,"d":"6,036"},{"v":5865,"d":"5,865"},{"v":6323,"d":"6,323"},0,0,0,0,171,150,136,131,{"v":4947,"d":"4,947"},{"v":4986,"d":"4,986"},{"v":5015,"d":"5,015"},{"v":5029,"d":"5,029"},{"v":4079,"d":"4,079"},{"v":4038,"d":"4,038"},{"v":4006,"d":"4,006"},{"v":3941,"d":"3,941"},{"v":5311,"d":"5,311"},{"v":5221,"d":"5,221"},{"v":5090,"d":"5,090"},{"v":4974,"d":"4,974"},{"v":57610,"d":"57,610"},{"v":117.4,"d":"117.40"},{"v":664.6,"d":"664.60"},{"v":897.2,"d":"897.20"},{"v":51.5,"d":"51.50"},{"v":102.6,"d":"102.60"},{"v":419.5,"d":"419.50"}]
[120,5,{"$f":"IF('iaith - language'!$K$1=2,VLOOKUP(A12,Text!$A$3:$C$353,2,FALSE),VLOOKUP(A12,Text!$A$3:$C$353,3,FALSE))","v":"Sir Ddinbych"},168,200,209,218,"N/A",{"v":83871.619,"d":"83,872"},{"v":96020.507413,"d":"96,021"},{"v":960.233985,"d":"960"},{"v":9756.235466,"d":"9,756"},{"v":15688.814773,"d":"15,689"},{"v":6006.073372,"d":"6,006"},{"v":10735.933713,"d":"10,736"},{"v":78651.65044900001,"d":"78,652"},{"v":3268.116603,"d":"3,268"},{"v":19642.040467,"d":"19,642"},{"v":52357.012642999995,"d":"52,357"},{"v":76378.46695299995,"d":"76,378"},{"v":65020.221985000004,"d":"65,020"},{"v":31000.285434999998,"d":"31,000"},{"v":2779.15792,"d":"2,779"},{"v":55921.39663099999,"d":"55,921"},{"v":96664,"d":"96,664"},{"v":77165,"d":"77,165"},{"v":23517,"d":"23,517"},null,0,9.4,753,{"v":4000,"d":"4,000"},{"v":1640,"d":"1,640"},{"v":11629,"d":"11,629"},{"v":1338,"d":"1,338"},{"v":9698,"d":"9,698"},{"v":11029382,"d":"11,029,382"},{"v":676185,"d":"676,185"},0,{"v":7466.735467847676,"d":"7,467"},{"v":4400.806284565748,"d":"4,401"},{"v":3500,"d":"3,500"},{"v":3555,"d":"3,555"},{"v":3530,"d":"3,530"},{"v":3470,"d":"3,470"},{"v":3600,"d":"3,600"},{"v":3615,"d":"3,615"},{"v":3520,"d":"3,520"},{"v":3310,"d":"3,310"},{"v":3045,"d":"3,045"},{"v":2880,"d":"2,880"},{"v":2795,"d":"2,795"},630,597,555,526,370,374,286,268,0,0,0,0,{"v":5569,"d":"5,569"},{"v":5609,"d":"5,609"},{"v":5669,"d":"5,669"},{"v":5965,"d":"5,965"},640,605,563,533,377,387,305,280,{"v":3566,"d":"3,566"},{"v":3514,"d":"3,514"},{"v":3477,"d":"3,477"},{"v":3412,"d":"3,412"},{"v":5453,"d":"5,453"},{"v":5492,"d":"5,492"},{"v":5539,"d":"5,539"},{"v":5822,"d":"5,822"},0,0,0,0,203,182,163,160,{"v":4890,"d":"4,890"},{"v":4969,"d":"4,969"},{"v":5034,"d":"5,034"},{"v":5078,"d":"5,078"},{"v":3566,"d":"3,566"},{"v":3514,"d":"3,514"},{"v":3477,"d":"3,477"},{"v":3412,"d":"3,412"},{"v":4583,"d":"4,583"},{"v":4506,"d":"4,506"},{"v":4345,"d":"4,345"},{"v":4225,"d":"4,225"},{"v":45360,"d":"45,360"},{"v":139.79999999999998,"d":"139.80"},{"v":655.3,"d":"655.30"},{"v":623.417,"d":"623.42"},{"v":29.7,"d":"29.70"},{"v":49.9,"d":"49.90"},{"v":222.237,"d":"222.24"}]
[121,6,{"$f":"IF('iaith - language'!$K$1=2,VLOOKUP(A13,Text!$A$3:$C$353,2,FALSE),VLOOKUP(A13,Text!$A$3:$C$353,3,FALSE))","v":"Sir y Fflint"},210,254,284,308,"N/A",{"v":43983.031,"d":"43,983"},{"v":157264.381805,"d":"157,264"},{"v":1658.87979,"d":"1,659"},{"v":16157.797583000001,"d":"16,158"},{"v":26054.241774000006,"d":"26,054"},{"v":10021.051328,"d":"10,021"},{"v":17917.527984,"d":"17,918"},{"v":128160.487042,"d":"128,160"},{"v":5387.543983,"d":"5,388"},{"v":32796.486955,"d":"32,796"},{"v":90355.12169200002,"d":"90,355"},{"v":124467.89485200001,"d":"124,468"},{"v":112833.07579599999,"d":"112,833"},{"v":44431.30601099999,"d":"44,431"},{"v":3993.476003,"d":"3,993"},{"v":95899.190717,"d":"95,899"},{"v":156847,"d":"156,847"},{"v":124648,"d":"124,648"},{"v":33294,"d":"33,294"},null,0,{"v":2.76,"d":"2.8"},522,{"v":5120,"d":"5,120"},{"v":1670,"d":"1,670"},{"v":20392,"d":"20,392"},{"v":1765,"d":"1,765"},{"v":10857,"d":"10,857"},{"v":11536663.37,"d":"11,536,663"},{"v":304483.1899999995,"d":"304,483"},4,{"v":3924.1983287717267,"d":"3,924"},{"v":2929.6085719648577,"d":"2,930"},{"v":4920,"d":"4,920"},{"v":4985,"d":"4,985"},{"v":4845,"d":"4,845"},{"v":4820,"d":"4,820"},{"v":5035,"d":"5,035"},{"v":5000,"d":"5,000"},{"v":4880,"d":"4,880"},{"v":4465,"d":"4,465"},{"v":4080,"d":"4,080"},{"v":3985,"d":"3,985"},{"v":3845,"d":"3,845"},530,498,466,445,569,694,562,507,0,0,0,0,{"v":7724,"d":"7,724"},{"v":7798,"d":"7,798"},{"v":7760,"d":"7,760"},{"v":8188,"d":"8,188"},539,507,474,445,580,709,581,518,{"v":3903,"d":"3,903"},{"v":3854,"d":"3,854"},{"v":3819,"d":"3,819"},{"v":3746,"d":"3,746"},{"v":7587,"d":"7,587"},{"v":7642,"d":"7,642"},{"v":7578,"d":"7,578"},{"v":8006,"d":"8,006"},0,0,0,0,150,128,120,113,{"v":5796,"d":"5,796"},{"v":5945,"d":"5,945"},{"v":6011,"d":"6,011"},{"v":6096,"d":"6,096"},{"v":3903,"d":"3,903"},{"v":3854,"d":"3,854"},{"v":3819,"d":"3,819"},{"v":3746,"d":"3,746"},{"v":5022,"d":"5,022"},{"v":5070,"d":"5,070"},{"v":4874,"d":"4,874"},{"v":4709,"d":"4,709"},{"v":70100,"d":"70,100"},{"v":152,"d":"152.00"},{"v":340.5,"d":"340.50"},{"v":686.9,"d":"686.90"},{"v":64.1,"d":"64.10"},{"v":111.2,"d":"111.20"},{"v":432.2,"d":"432.20"}]
[122,7,{"$f":"IF('iaith - language'!$K$1=2,VLOOKUP(A14,Text!$A$3:$C$353,2,FALSE),VLOOKUP(A14,Text!$A$3:$C$353,3,FALSE))","v":"Wrecsam"},23,143,235,290,"N/A",{"v":50377.349,"d":"50,377"},{"v":136534.845442,"d":"136,535"},{"v":1505.438147,"d":"1,505"},{"v":14569.475752,"d":"14,569"},{"v":23177.409364,"d":"23,177"},{"v":8729.542843,"d":"8,730"},{"v":15923.72432620026,"d":"15,924"},{"v":110608.87097196047,"d":"110,609"},{"v":4766.892591,"d":"4,767"},{"v":29213.929072039515,"d":"29,214"},{"v":79109.9162591468,"d":"79,110"},{"v":107320.91637396047,"d":"107,321"},{"v":99823.48133118635,"d":"99,823"},{"v":36711.36411481366,"d":"36,711"},{"v":3459.735804,"d":"3,460"},{"v":83968.95427814679,"d":"83,969"},{"v":136055,"d":"136,055"},{"v":107142,"d":"107,142"},{"v":27749,"d":"27,749"},null,0,{"v":0,"d":"0.0"},472,{"v":4060,"d":"4,060"},{"v":1430,"d":"1,430"},{"v":13203,"d":"13,203"},{"v":1590,"d":"1,590"},{"v":11648,"d":"11,648"},{"v":11249947.87,"d":"11,249,948"},{"v":456398.2400000002,"d":"456,398"},0,{"v":1197.97669333984,"d":"1,198"},{"v":1544.2190134067457,"d":"1,544"},{"v":4745,"d":"4,745"},{"v":4830,"d":"4,830"},{"v":4715,"d":"4,715"},{"v":4790,"d":"4,790"},{"v":4955,"d":"4,955"},{"v":4900,"d":"4,900"},{"v":4795,"d":"4,795"},{"v":4450,"d":"4,450"},{"v":4100,"d":"4,100"},{"v":4030,"d":"4,030"},{"v":3820,"d":"3,820"},722,671,618,586,404,539,455,381,0,0,0,0,{"v":7858,"d":"7,858"},{"v":7813,"d":"7,813"},{"v":7793,"d":"7,793"},{"v":8232,"d":"8,232"},727,684,624,588,406,546,465,387,{"v":3758,"d":"3,758"},{"v":3699,"d":"3,699"},{"v":3645,"d":"3,645"},{"v":3551,"d":"3,551"},{"v":7722,"d":"7,722"},{"v":7658,"d":"7,658"},{"v":7620,"d":"7,620"},{"v":8044,"d":"8,044"},0,0,0,0,215,205,179,172,{"v":5817,"d":"5,817"},{"v":5905,"d":"5,905"},{"v":5971,"d":"5,971"},{"v":6013,"d":"6,013"},{"v":3758,"d":"3,758"},{"v":3699,"d":"3,699"},{"v":3645,"d":"3,645"},{"v":3551,"d":"3,551"},{"v":4891,"d":"4,891"},{"v":4929,"d":"4,929"},{"v":4734,"d":"4,734"},{"v":4526,"d":"4,526"},{"v":60930,"d":"60,930"},{"v":110,"d":"110.00"},{"v":513,"d":"513.00"},{"v":519,"d":"519.00"},{"v":30.7,"d":"30.70"},{"v":126.4,"d":"126.40"},{"v":297.3,"d":"297.30"}]
[123,8,{"$f":"IF('iaith - language'!$K$1=2,VLOOKUP(A15,Text!$A$3:$C$353,2,FALSE),VLOOKUP(A15,Text!$A$3:$C$353,3,FALSE))","v":"Powys"},330,399,395,433,"N/A",{"v":519531.10199999897,"d":"519,531"},{"v":132537.788164,"d":"132,538"},{"v":1213.903998,"d":"1,214"},{"v":11721.702518,"d":"11,722"},{"v":19064.713745,"d":"19,065"},{"v":7360.1742380000005,"d":"7,360"},{"v":13287.148053,"d":"13,287"},{"v":111371.50096199999,"d":"111,372"},{"v":4242.312838,"d":"4,242"},{"v":24069.475123999997,"d":"24,069"},{"v":70910.77980500001,"d":"70,911"},{"v":108468.31304200002,"d":"108,468"},{"v":84276.92164799996,"d":"84,277"},{"v":48260.86651799999,"d":"48,261"},{"v":5013.154272,"d":"5,013"},{"v":75851.50958299999,"d":"75,852"},{"v":133030,"d":"133,030"},{"v":109186,"d":"109,186"},{"v":36801,"d":"36,801"},null,{"v":44427,"d":"44,427"},{"v":0,"d":"0.0"},{"v":3916,"d":"3,916"},{"v":6740,"d":"6,740"},{"v":2520,"d":"2,520"},{"v":15664,"d":"15,664"},{"v":1725,"d":"1,725"},{"v":10214,"d":"10,214"},{"v":11076131.31,"d":"11,076,131"},{"v":628860.9633333342,"d":"628,861"},0,{"v":9102.60955724062,"d":"9,103"},{"v":3010.7827405707812,"d":"3,011"},{"v":3365,"d":"3,365"},{"v":3375,"d":"3,375"},{"v":3260,"d":"3,260"},{"v":3235,"d":"3,235"},{"v":3325,"d":"3,325"},{"v":3305,"d":"3,305"},{"v":3150,"d":"3,150"},{"v":2970,"d":"2,970"},{"v":2665,"d":"2,665"},{"v":2570,"d":"2,570"},{"v":2425,"d":"2,425"},407,383,355,347,457,571,420,313,0,0,0,0,{"v":4814,"d":"4,814"},{"v":4728,"d":"4,728"},{"v":4672,"d":"4,672"},{"v":4968,"d":"4,968"},412,385,365,352,470,594,445,331,{"v":3680,"d":"3,680"},{"v":3651,"d":"3,651"},{"v":3633,"d":"3,633"},{"v":3574,"d":"3,574"},{"v":4707,"d":"4,707"},{"v":4628,"d":"4,628"},{"v":4563,"d":"4,563"},{"v":4853,"d":"4,853"},0,0,0,0,146,132,127,122,{"v":4507,"d":"4,507"},{"v":4576,"d":"4,576"},{"v":4625,"d":"4,625"},{"v":4654,"d":"4,654"},{"v":3680,"d":"3,680"},{"v":3651,"d":"3,651"},{"v":3633,"d":"3,633"},{"v":3574,"d":"3,574"},{"v":4562,"d":"4,562"},{"v":4630,"d":"4,630"},{"v":4443,"d":"4,443"},{"v":4257,"d":"4,257"},{"v":65260,"d":"65,260"},{"v":242.6,"d":"242.60"},{"v":2708.2000000000003,"d":"2,708.20"},{"v":2127.6,"d":"2,127.60"},{"v":34.4,"d":"34.40"},{"v":114.3,"d":"114.30"},{"v":219.3,"d":"219.30"}]
[124,9,{"$f":"IF('iaith - language'!$K$1=2,VLOOKUP(A16,Text!$A$3:$C$353,2,FALSE),VLOOKUP(A16,Text!$A$3:$C$353,3,FALSE))","v":"Sir Ceredigion"},191,258,271,279,"N/A",{"v":178837.928,"d":"178,838"},{"v":71151.249698,"d":"71,151"},{"v":601.653917,"d":"602"},{"v":6159.298788,"d":"6,159"},{"v":9837.311166999998,"d":"9,837"},{"v":3775.1394849999997,"d":"3,775"},{"v":9871.660443,"d":"9,872"},{"v":60336.86505000001,"d":"60,337"},{"v":2359.1036050000002,"d":"2,359"},{"v":12244.97556,"d":"12,245"},{"v":39917.344107,"d":"39,917"},{"v":58906.274141,"d":"58,906"},{"v":46963.978526,"d":"46,964"},{"v":24187.271174999998,"d":"24,187"},{"v":2662.122441,"d":"2,662"},{"v":42357.93217399998,"d":"42,358"},{"v":72895,"d":"72,895"},{"v":60661,"d":"60,661"},{"v":18668,"d":"18,668"},null,{"v":11325,"d":"11,325"},{"v":12.915,"d":"12.9"},{"v":1969,"d":"1,969"},{"v":3910,"d":"3,910"},{"v":1400,"d":"1,400"},{"v":6824,"d":"6,824"},877,{"v":5740,"d":"5,740"},{"v":6319564.99,"d":"6,319,565"},{"v":353847.863333333,"d":"353,848"},0,{"v":7196.841815141547,"d":"7,197"},{"v":1576.273821438412,"d":"1,576"},{"v":1800,"d":"1,800"},{"v":1850,"d":"1,850"},{"v":1875,"d":"1,875"},{"v":1855,"d":"1,855"},{"v":1900,"d":"1,900"},{"v":1925,"d":"1,925"},{"v":1845,"d":"1,845"},{"v":1720,"d":"1,720"},{"v":1585,"d":"1,585"},{"v":1470,"d":"1,470"},{"v":1415,"d":"1,415"},233,213,196,190,183,175,159,146,0,0,0,0,{"v":2732,"d":"2,732"},{"v":2777,"d":"2,777"},{"v":2769,"d":"2,769"},{"v":2985,"d":"2,985"},232,221,200,190,192,182,170,155,{"v":2082,"d":"2,082"},{"v":2057,"d":"2,057"},{"v":2042,"d":"2,042"},{"v":2011,"d":"2,011"},{"v":2683,"d":"2,683"},{"v":2712,"d":"2,712"},{"v":2704,"d":"2,704"},{"v":2907,"d":"2,907"},0,0,0,0,43,35,31,30,{"v":2673,"d":"2,673"},{"v":2690,"d":"2,690"},{"v":2709,"d":"2,709"},{"v":2730,"d":"2,730"},{"v":2082,"d":"2,082"},{"v":2057,"d":"2,057"},{"v":2042,"d":"2,042"},{"v":2011,"d":"2,011"},{"v":2506,"d":"2,506"},{"v":2460,"d":"2,460"},{"v":2412,"d":"2,412"},{"v":2356,"d":"2,356"},{"v":35620,"d":"35,620"},{"v":158.3,"d":"158.30"},{"v":1166.63,"d":"1,166.63"},{"v":826.1,"d":"826.10"},{"v":34.4,"d":"34.40"},{"v":100.83000000000001,"d":"100.83"},{"v":124.7,"d":"124.70"}]
[125,10,{"$f":"IF('iaith - language'!$K$1=2,VLOOKUP(A17,Text!$A$3:$C$353,2,FALSE),VLOOKUP(A17,Text!$A$3:$C$353,3,FALSE))","v":"Sir Benfro"},195,220,208,265,"N/A",{"v":161834.46000000002,"d":"161,834"},{"v":126301.47421,"d":"126,301"},{"v":1141.342071,"d":"1,141"},{"v":11885.114410000002,"d":"11,885"},{"v":19292.911404000002,"d":"19,293"},{"v":7470.932057,"d":"7,471"},{"v":13463.975679,"d":"13,464"},{"v":105137.601016,"d":"105,138"},{"v":4163.618284,"d":"4,164"},{"v":24011.034736999998,"d":"24,011"},{"v":68131.90952999999,"d":"68,132"},{"v":102290.43947399997,"d":"102,290"},{"v":82518.14159,"d":"82,518"},{"v":43783.332621000016,"d":"43,783"},{"v":4612.784778,"d":"4,613"},{"v":72755.03386500002,"d":"72,755"},{"v":126751,"d":"126,751"},{"v":102744,"d":"102,744"},{"v":33169,"d":"33,169"},null,0,12.3,{"v":1760,"d":"1,760"},{"v":7130,"d":"7,130"},{"v":2240,"d":"2,240"},{"v":15467,"d":"15,467"},{"v":1559,"d":"1,559"},{"v":10225,"d":"10,225"},{"v":9670981,"d":"9,670,981"},{"v":151671.75,"d":"151,672"},{"v":2325,"d":"2,325"},{"v":14583.462032534306,"d":"14,583"},{"v":2051.6604497195,"d":"2,052"},{"v":3945,"d":"3,945"},{"v":3930,"d":"3,930"},{"v":4000,"d":"4,000"},{"v":3950,"d":"3,950"},{"v":4140,"d":"4,140"},{"v":4045,"d":"4,045"},{"v":3925,"d":"3,925"},{"v":3605,"d":"3,605"},{"v":3275,"d":"3,275"},{"v":3135,"d":"3,135"},{"v":3035,"d":"3,035"},669,637,594,568,524,506,471,441,0,0,0,0,{"v":6159,"d":"6,159"},{"v":6064,"d":"6,064"},{"v":5938,"d":"5,938"},{"v":6289,"d":"6,289"},683,639,608,577,542,520,483,449,{"v":3914,"d":"3,914"},{"v":3887,"d":"3,887"},{"v":3863,"d":"3,863"},{"v":3783,"d":"3,783"},{"v":6036,"d":"6,036"},{"v":5944,"d":"5,944"},{"v":5798,"d":"5,798"},{"v":6134,"d":"6,134"},0,0,0,0,76,75,68,66,{"v":5346,"d":"5,346"},{"v":5400,"d":"5,400"},{"v":5444,"d":"5,444"},{"v":5506,"d":"5,506"},{"v":3914,"d":"3,914"},{"v":3887,"d":"3,887"},{"v":3863,"d":"3,863"},{"v":3783,"d":"3,783"},{"v":5139,"d":"5,139"},{"v":5046,"d":"5,046"},{"v":4954,"d":"4,954"},{"v":4809,"d":"4,809"},{"v":61930,"d":"61,930"},{"v":160.538,"d":"160.54"},{"v":1220.46,"d":"1,220.46"},{"v":1103.046,"d":"1,103.05"},{"v":54.065,"d":"54.07"},{"v":167.813,"d":"167.81"},{"v":325.426,"d":"325.43"}]
[126,11,{"$f":"IF('iaith - language'!$K$1=2,VLOOKUP(A18,Text!$A$3:$C$353,2,FALSE),VLOOKUP(A18,Text!$A$3:$C$353,3,FALSE))","v":"Sir Gaerfyrddin"},315,334,412,445,"N/A",{"v":237110.37900000002,"d":"237,110"},{"v":189525.471085,"d":"189,525"},{"v":1913.464411,"d":"1,913"},{"v":18937.055057,"d":"18,937"},{"v":30272.665709,"d":"30,273"},{"v":11516.122229,"d":"11,516"},{"v":21052.58066,"d":"21,053"},{"v":155890.054915,"d":"155,890"},{"v":6335.1636610000005,"d":"6,335"},{"v":37981.268583000005,"d":"37,981"},{"v":105398.97466500003,"d":"105,399"},{"v":151544.20250200006,"d":"151,544"},{"v":129449.44103500003,"d":"129,449"},{"v":60076.03004999999,"d":"60,076"},{"v":5560.4428179999995,"d":"5,560"},{"v":112386.95900899997,"d":"112,387"},{"v":190073,"d":"190,073"},{"v":152810,"d":"152,810"},{"v":45693,"d":"45,693"},null,0,{"v":9.06,"d":"9.1"},{"v":3090,"d":"3,090"},{"v":6990,"d":"6,990"},{"v":2690,"d":"2,690"},{"v":20642,"d":"20,642"},{"v":2404,"d":"2,404"},{"v":16201,"d":"16,201"},{"v":17011762.6,"d":"17,011,763"},{"v":713157.106666665,"d":"713,157"},0,{"v":4708.469984729656,"d":"4,708"},{"v":2314.5232160613473,"d":"2,315"},{"v":5795,"d":"5,795"},{"v":5775,"d":"5,775"},{"v":5615,"d":"5,615"},{"v":5510,"d":"5,510"},{"v":5815,"d":"5,815"},{"v":5735,"d":"5,735"},{"v":5665,"d":"5,665"},{"v":5220,"d":"5,220"},{"v":4820,"d":"4,820"},{"v":4780,"d":"4,780"},{"v":4585,"d":"4,585"},986,921,851,803,856,888,707,627,0,0,0,0,{"v":8329,"d":"8,329"},{"v":8532,"d":"8,532"},{"v":8521,"d":"8,521"},{"v":9110,"d":"9,110"},996,937,865,820,877,913,732,646,{"v":5855,"d":"5,855"},{"v":5824,"d":"5,824"},{"v":5732,"d":"5,732"},{"v":5593,"d":"5,593"},{"v":8172,"d":"8,172"},{"v":8356,"d":"8,356"},{"v":8327,"d":"8,327"},{"v":8881,"d":"8,881"},0,0,0,0,141,130,119,118,{"v":9362,"d":"9,362"},{"v":9478,"d":"9,478"},{"v":9558,"d":"9,558"},{"v":9698,"d":"9,698"},{"v":5850,"d":"5,850"},{"v":5817,"d":"5,817"},{"v":5728,"d":"5,728"},{"v":5590,"d":"5,590"},{"v":7728,"d":"7,728"},{"v":7674,"d":"7,674"},{"v":7329,"d":"7,329"},{"v":7059,"d":"7,059"},{"v":88750,"d":"88,750"},{"v":249.6,"d":"249.60"},{"v":1615.6,"d":"1,615.60"},{"v":1619.8,"d":"1,619.80"},{"v":90.4,"d":"90.40"},{"v":196.5,"d":"196.50"},{"v":407.2,"d":"407.20"}]
[127,12,{"$f":"IF('iaith - language'!$K$1=2,VLOOKUP(A19,Text!$A$3:$C$353,2,FALSE),VLOOKUP(A19,Text!$A$3:$C$353,3,FALSE))","v":"Abertawe"},411,528,504,645,"N/A",{"v":37761.478999999905,"d":"37,761"},{"v":249275.004029,"d":"249,275"},{"v":2498.909621,"d":"2,499"},{"v":23959.500874999998,"d":"23,960"},{"v":37636.069777000004,"d":"37,636"},{"v":13738.787683999999,"d":"13,739"},{"v":30988.038232,"d":"30,988"},{"v":206810.899304,"d":"206,811"},{"v":8350.363644000001,"d":"8,350"},{"v":47832.03136100001,"d":"47,832"},{"v":151780.8017,"d":"151,781"},{"v":201442.97266899998,"d":"201,443"},{"v":184856.88259599995,"d":"184,857"},{"v":64418.121434,"d":"64,418"},{"v":6749.137375,"d":"6,749"},{"v":159945.80044700005,"d":"159,946"},{"v":246563,"d":"246,563"},{"v":199723,"d":"199,723"},{"v":48958,"d":"48,958"},null,0,7.9,379,{"v":7650,"d":"7,650"},{"v":2930,"d":"2,930"},{"v":28839,"d":"28,839"},{"v":3009,"d":"3,009"},{"v":22852,"d":"22,852"},{"v":23182639.58,"d":"23,182,640"},{"v":677426.180000001,"d":"677,426"},135,{"v":5424.424152535633,"d":"5,424"},{"v":3124.81842892492,"d":"3,125"},{"v":8725,"d":"8,725"},{"v":8860,"d":"8,860"},{"v":8655,"d":"8,655"},{"v":8405,"d":"8,405"},{"v":8795,"d":"8,795"},{"v":8835,"d":"8,835"},{"v":8780,"d":"8,780"},{"v":8265,"d":"8,265"},{"v":7705,"d":"7,705"},{"v":7555,"d":"7,555"},{"v":7250,"d":"7,250"},{"v":1327,"d":"1,327"},{"v":1255,"d":"1,255"},{"v":1173,"d":"1,173"},{"v":1126,"d":"1,126"},955,{"v":1024,"d":"1,024"},902,846,0,0,0,0,{"v":14165,"d":"14,165"},{"v":14304,"d":"14,304"},{"v":14124,"d":"14,124"},{"v":14782,"d":"14,782"},{"v":1335,"d":"1,335"},{"v":1266,"d":"1,266"},{"v":1184,"d":"1,184"},{"v":1136,"d":"1,136"},971,{"v":1047,"d":"1,047"},922,870,{"v":7239,"d":"7,239"},{"v":7166,"d":"7,166"},{"v":7116,"d":"7,116"},{"v":7027,"d":"7,027"},{"v":13928,"d":"13,928"},{"v":14039,"d":"14,039"},{"v":13844,"d":"13,844"},{"v":14495,"d":"14,495"},0,0,0,0,163,159,151,143,{"v":12381,"d":"12,381"},{"v":12516,"d":"12,516"},{"v":12649,"d":"12,649"},{"v":12831,"d":"12,831"},{"v":7239,"d":"7,239"},{"v":7166,"d":"7,166"},{"v":7116,"d":"7,116"},{"v":7027,"d":"7,027"},{"v":9545,"d":"9,545"},{"v":9479,"d":"9,479"},{"v":9222,"d":"9,222"},{"v":9033,"d":"9,033"},{"v":113970,"d":"113,970"},{"v":102.29999999999998,"d":"102.30"},{"v":231.2,"d":"231.20"},{"v":778.8,"d":"778.80"},{"v":70.69999999999999,"d":"70.70"},{"v":138.9,"d":"138.90"},{"v":650.3,"d":"650.30"}]
[128,13,{"$f":"IF('iaith - language'!$K$1=2,VLOOKUP(A20,Text!$A$3:$C$353,2,FALSE),VLOOKUP(A20,Text!$A$3:$C$353,3,FALSE))","v":"Castell-nedd Port Talbot"},173,204,195,254,"N/A",{"v":44227.262,"d":"44,227"},{"v":144447.136915,"d":"144,447"},{"v":1501.332633,"d":"1,501"},{"v":14392.992288,"d":"14,393"},{"v":22683.771692,"d":"22,684"},{"v":8320.298007000001,"d":"8,320"},{"v":16087.571084000003,"d":"16,088"},{"v":118962.703427,"d":"118,963"},{"v":4874.168924,"d":"4,874"},{"v":28800.256946,"d":"28,800"},{"v":84952.075814,"d":"84,952"},{"v":115646.87996899999,"d":"115,647"},{"v":103872.12145600001,"d":"103,872"},{"v":40575.015459,"d":"40,575"},{"v":3544.118578,"d":"3,544"},{"v":90111.68240099997,"d":"90,112"},{"v":144386,"d":"144,386"},{"v":116296,"d":"116,296"},{"v":30254,"d":"30,254"},null,0,2.9,226,{"v":4030,"d":"4,030"},{"v":1780,"d":"1,780"},{"v":19477,"d":"19,477"},{"v":1902,"d":"1,902"},{"v":17318,"d":"17,318"},{"v":19556958.48,"d":"19,556,958"},{"v":603774.6566666675,"d":"603,775"},168,{"v":921.7262739174663,"d":"922"},{"v":1145.5310161670388,"d":"1,146"},{"v":5020,"d":"5,020"},{"v":4950,"d":"4,950"},{"v":4845,"d":"4,845"},{"v":4700,"d":"4,700"},{"v":4875,"d":"4,875"},{"v":4805,"d":"4,805"},{"v":4750,"d":"4,750"},{"v":4475,"d":"4,475"},{"v":4110,"d":"4,110"},{"v":4055,"d":"4,055"},{"v":3900,"d":"3,900"},{"v":1086,"d":"1,086"},{"v":1024,"d":"1,024"},974,915,449,555,457,375,0,0,0,0,{"v":9028,"d":"9,028"},{"v":9097,"d":"9,097"},{"v":8829,"d":"8,829"},{"v":9238,"d":"9,238"},{"v":1098,"d":"1,098"},{"v":1042,"d":"1,042"},986,928,460,564,474,389,{"v":4877,"d":"4,877"},{"v":4819,"d":"4,819"},{"v":4759,"d":"4,759"},{"v":4658,"d":"4,658"},{"v":8893,"d":"8,893"},{"v":8951,"d":"8,951"},{"v":8655,"d":"8,655"},{"v":9057,"d":"9,057"},0,0,0,0,136,129,123,114,{"v":9265,"d":"9,265"},{"v":9321,"d":"9,321"},{"v":9375,"d":"9,375"},{"v":9429,"d":"9,429"},{"v":4877,"d":"4,877"},{"v":4819,"d":"4,819"},{"v":4759,"d":"4,759"},{"v":4658,"d":"4,658"},{"v":6435,"d":"6,435"},{"v":6425,"d":"6,425"},{"v":6219,"d":"6,219"},{"v":5975,"d":"5,975"},{"v":66760,"d":"66,760"},{"v":118,"d":"118.00"},{"v":116.1,"d":"116.10"},{"v":598.8,"d":"598.80"},{"v":66.3,"d":"66.30"},{"v":68.8,"d":"68.80"},{"v":478.9,"d":"478.90"}]
[129,14,{"$f":"IF('iaith - language'!$K$1=2,VLOOKUP(A21,Text!$A$3:$C$353,2,FALSE),VLOOKUP(A21,Text!$A$3:$C$353,3,FALSE))","v":"Pen-y-bont ar Ogwr"},167,256,275,265,"N/A",{"v":25078.530000000002,"d":"25,079"},{"v":147891.853192,"d":"147,892"},{"v":1614.390473,"d":"1,614"},{"v":15364.817592000001,"d":"15,365"},{"v":23801.174527000003,"d":"23,801"},{"v":8595.25397,"d":"8,595"},{"v":15911.108041,"d":"15,911"},{"v":121064.60183200001,"d":"121,065"},{"v":4925.36341,"d":"4,925"},{"v":30172.266988000003,"d":"30,172"},{"v":86863.16061200002,"d":"86,863"},{"v":117719.58620800005,"d":"117,720"},{"v":107274.620097,"d":"107,275"},{"v":40617.233099,"d":"40,617"},{"v":3539.8533690000004,"d":"3,540"},{"v":91929.802172,"d":"91,930"},{"v":147539,"d":"147,539"},{"v":118204,"d":"118,204"},{"v":30168,"d":"30,168"},null,0,{"v":2.35,"d":"2.4"},201,{"v":5060,"d":"5,060"},{"v":1770,"d":"1,770"},{"v":19761,"d":"19,761"},{"v":1878,"d":"1,878"},{"v":13049,"d":"13,049"},{"v":15298283,"d":"15,298,283"},{"v":325469.3333333333,"d":"325,469"},0,{"v":2664.300692537582,"d":"2,664"},{"v":3061.249452487455,"d":"3,061"},{"v":4970,"d":"4,970"},{"v":5070,"d":"5,070"},{"v":4990,"d":"4,990"},{"v":4870,"d":"4,870"},{"v":5055,"d":"5,055"},{"v":4945,"d":"4,945"},{"v":4825,"d":"4,825"},{"v":4465,"d":"4,465"},{"v":4095,"d":"4,095"},{"v":3990,"d":"3,990"},{"v":3850,"d":"3,850"},{"v":1001,"d":"1,001"},941,871,820,463,565,492,425,0,0,0,0,{"v":8042,"d":"8,042"},{"v":8064,"d":"8,064"},{"v":8031,"d":"8,031"},{"v":8472,"d":"8,472"},{"v":1011,"d":"1,011"},951,880,834,468,572,493,430,{"v":3923,"d":"3,923"},{"v":3866,"d":"3,866"},{"v":3814,"d":"3,814"},{"v":3724,"d":"3,724"},{"v":7891,"d":"7,891"},{"v":7894,"d":"7,894"},{"v":7859,"d":"7,859"},{"v":8281,"d":"8,281"},0,0,0,0,285,216,145,136,{"v":7505,"d":"7,505"},{"v":7611,"d":"7,611"},{"v":7737,"d":"7,737"},{"v":7761,"d":"7,761"},{"v":3923,"d":"3,923"},{"v":3866,"d":"3,866"},{"v":3814,"d":"3,814"},{"v":3724,"d":"3,724"},{"v":5402,"d":"5,402"},{"v":5389,"d":"5,389"},{"v":5187,"d":"5,187"},{"v":4988,"d":"4,988"},{"v":65290,"d":"65,290"},{"v":104,"d":"104.00"},{"v":139,"d":"139.00"},{"v":545.6,"d":"545.60"},{"v":52.3,"d":"52.30"},{"v":83.3,"d":"83.30"},{"v":443.2,"d":"443.20"}]
[130,15,{"$f":"IF('iaith - language'!$K$1=2,VLOOKUP(A22,Text!$A$3:$C$353,2,FALSE),VLOOKUP(A22,Text!$A$3:$C$353,3,FALSE))","v":"Bro Morgannwg"},300,389,380,399,"N/A",{"v":33126.14000000001,"d":"33,126"},{"v":135616.853423,"d":"135,617"},{"v":1480.943206,"d":"1,481"},{"v":14299.603834,"d":"14,300"},{"v":22627.403954999998,"d":"22,627"},{"v":8429.724068,"d":"8,430"},{"v":15029.53901,"d":"15,030"},{"v":110295.20054700001,"d":"110,295"},{"v":4627.663538,"d":"4,628"},{"v":28495.782075,"d":"28,496"},{"v":77392.46996400002,"d":"77,392"},{"v":107121.07135000007,"d":"107,121"},{"v":96756.53655999998,"d":"96,757"},{"v":38860.316865000015,"d":"38,860"},{"v":3534.9554910000006,"d":"3,535"},{"v":82239.410238,"d":"82,239"},{"v":135295,"d":"135,295"},{"v":107403,"d":"107,403"},{"v":28838,"d":"28,838"},null,0,{"v":4,"d":"4.0"},301,{"v":3580,"d":"3,580"},{"v":1550,"d":"1,550"},{"v":15743,"d":"15,743"},{"v":1419,"d":"1,419"},{"v":9754,"d":"9,754"},{"v":11048902.17,"d":"11,048,902"},{"v":458004.57333333354,"d":"458,005"},48,{"v":2239.696563194744,"d":"2,240"},{"v":3669.029081886837,"d":"3,669"},{"v":4185,"d":"4,185"},{"v":4230,"d":"4,230"},{"v":4185,"d":"4,185"},{"v":4105,"d":"4,105"},{"v":4255,"d":"4,255"},{"v":4275,"d":"4,275"},{"v":4150,"d":"4,150"},{"v":3875,"d":"3,875"},{"v":3610,"d":"3,610"},{"v":3495,"d":"3,495"},{"v":3275,"d":"3,275"},689,641,585,557,520,582,483,433,0,0,0,0,{"v":5687,"d":"5,687"},{"v":5824,"d":"5,824"},{"v":5919,"d":"5,919"},{"v":6247,"d":"6,247"},699,650,594,563,526,593,499,448,{"v":3129,"d":"3,129"},{"v":3083,"d":"3,083"},{"v":3046,"d":"3,046"},{"v":2985,"d":"2,985"},{"v":5601,"d":"5,601"},{"v":5726,"d":"5,726"},{"v":5793,"d":"5,793"},{"v":6111,"d":"6,111"},0,0,0,0,175,132,88,78,{"v":4885,"d":"4,885"},{"v":4939,"d":"4,939"},{"v":5019,"d":"5,019"},{"v":5087,"d":"5,087"},{"v":3129,"d":"3,129"},{"v":3083,"d":"3,083"},{"v":3046,"d":"3,046"},{"v":2985,"d":"2,985"},{"v":4354,"d":"4,354"},{"v":4326,"d":"4,326"},{"v":4139,"d":"4,139"},{"v":3996,"d":"3,996"},{"v":60420,"d":"60,420"},{"v":73.9,"d":"73.90"},{"v":369.1,"d":"369.10"},{"v":592.3,"d":"592.30"},{"v":21.4,"d":"21.40"},{"v":53.5,"d":"53.50"},{"v":373.9,"d":"373.90"}]
[131,16,{"$f":"IF('iaith - language'!$K$1=2,VLOOKUP(A23,Text!$A$3:$C$353,2,FALSE),VLOOKUP(A23,Text!$A$3:$C$353,3,FALSE))","v":"Rhondda Cynon Taf"},228,403,330,469,"N/A",{"v":42415.042,"d":"42,415"},{"v":242783.885512,"d":"242,784"},{"v":2644.616126,"d":"2,645"},{"v":25363.82662,"d":"25,364"},{"v":39943.620307000005,"d":"39,944"},{"v":14724.91347,"d":"14,725"},{"v":28494.35224,"d":"28,494"},{"v":197795.21634500002,"d":"197,795"},{"v":8294.659465,"d":"8,295"},{"v":50650.45843300001,"d":"50,650"},{"v":144680.077973,"d":"144,680"},{"v":192133.42707900002,"d":"192,133"},{"v":180289.684598,"d":"180,290"},{"v":62494.20091400001,"d":"62,494"},{"v":5494.028494,"d":"5,494"},{"v":153070.64304499998,"d":"153,071"},{"v":241873,"d":"241,873"},{"v":191775,"d":"191,775"},{"v":46755,"d":"46,755"},null,0,{"v":0,"d":"0.0"},268,{"v":6970,"d":"6,970"},{"v":3020,"d":"3,020"},{"v":30022,"d":"30,022"},{"v":3104,"d":"3,104"},{"v":25704,"d":"25,704"},{"v":25465977,"d":"25,465,977"},{"v":1022529.3333333334,"d":"1,022,529"},0,{"v":1282.9150998168502,"d":"1,283"},{"v":1575.144551455473,"d":"1,575"},{"v":9185,"d":"9,185"},{"v":9100,"d":"9,100"},{"v":9025,"d":"9,025"},{"v":8745,"d":"8,745"},{"v":9065,"d":"9,065"},{"v":8975,"d":"8,975"},{"v":8720,"d":"8,720"},{"v":8095,"d":"8,095"},{"v":7440,"d":"7,440"},{"v":7210,"d":"7,210"},{"v":7020,"d":"7,020"},{"v":2005,"d":"2,005"},{"v":1882,"d":"1,882"},{"v":1743,"d":"1,743"},{"v":1653,"d":"1,653"},{"v":1139,"d":"1,139"},{"v":1191,"d":"1,191"},{"v":1038,"d":"1,038"},834,0,0,0,0,{"v":13944,"d":"13,944"},{"v":13793,"d":"13,793"},{"v":13557,"d":"13,557"},{"v":14242,"d":"14,242"},{"v":2020,"d":"2,020"},{"v":1897,"d":"1,897"},{"v":1762,"d":"1,762"},{"v":1678,"d":"1,678"},{"v":1162,"d":"1,162"},{"v":1212,"d":"1,212"},{"v":1066,"d":"1,066"},865,{"v":7697,"d":"7,697"},{"v":7585,"d":"7,585"},{"v":7458,"d":"7,458"},{"v":7309,"d":"7,309"},{"v":13763,"d":"13,763"},{"v":13616,"d":"13,616"},{"v":13363,"d":"13,363"},{"v":14035,"d":"14,035"},0,0,0,0,473,376,255,234,{"v":13498,"d":"13,498"},{"v":13707,"d":"13,707"},{"v":13914,"d":"13,914"},{"v":14109,"d":"14,109"},{"v":7697,"d":"7,697"},{"v":7585,"d":"7,585"},{"v":7458,"d":"7,458"},{"v":7309,"d":"7,309"},{"v":10879,"d":"10,879"},{"v":10694,"d":"10,694"},{"v":10286,"d":"10,286"},{"v":9852,"d":"9,852"},{"v":110350,"d":"110,350"},{"v":165.39999999999998,"d":"165.40"},{"v":199.7,"d":"199.70"},{"v":929.7,"d":"929.70"},{"v":76.1,"d":"76.10"},{"v":127.80000000000001,"d":"127.80"},{"v":793.9,"d":"793.90"}]
[132,17,{"$f":"IF('iaith - language'!$K$1=2,VLOOKUP(A24,Text!$A$3:$C$353,2,FALSE),VLOOKUP(A24,Text!$A$3:$C$353,3,FALSE))","v":"Merthyr Tudful"},65,105,94,124,"N/A",{"v":11195.7019999999,"d":"11,196"},{"v":60919.491203,"d":"60,919"},{"v":717.157879,"d":"717"},{"v":6814.827112000001,"d":"6,815"},{"v":10491.761727000003,"d":"10,492"},{"v":3742.4077310000002,"d":"3,742"},{"v":6876.679843000001,"d":"6,877"},{"v":49016.764359,"d":"49,017"},{"v":1976.854628,"d":"1,977"},{"v":13256.354421000002,"d":"13,256"},{"v":36016.174264,"d":"36,016"},{"v":47663.136787999996,"d":"47,663"},{"v":45183.611958999994,"d":"45,184"},{"v":15735.879250000002,"d":"15,736"},{"v":1297.14158,"d":"1,297"},{"v":38035.926365,"d":"38,036"},{"v":60424,"d":"60,424"},{"v":47544,"d":"47,544"},{"v":11394,"d":"11,394"},null,0,{"v":0,"d":"0.0"},50,{"v":1800,"d":"1,800"},780,{"v":7504,"d":"7,504"},773,{"v":6341,"d":"6,341"},{"v":6899702.56,"d":"6,899,703"},{"v":132902.0023333331,"d":"132,902"},0,{"v":552.4434859338008,"d":"552"},{"v":1159.6662096807067,"d":"1,160"},{"v":2430,"d":"2,430"},{"v":2425,"d":"2,425"},{"v":2375,"d":"2,375"},{"v":2355,"d":"2,355"},{"v":2410,"d":"2,410"},{"v":2400,"d":"2,400"},{"v":2330,"d":"2,330"},{"v":2185,"d":"2,185"},{"v":2035,"d":"2,035"},{"v":1990,"d":"1,990"},{"v":1935,"d":"1,935"},515,471,442,411,297,298,236,216,0,0,0,0,{"v":4074,"d":"4,074"},{"v":4054,"d":"4,054"},{"v":3978,"d":"3,978"},{"v":4172,"d":"4,172"},515,477,439,409,305,306,246,222,{"v":1957,"d":"1,957"},{"v":1945,"d":"1,945"},{"v":1907,"d":"1,907"},{"v":1869,"d":"1,869"},{"v":4009,"d":"4,009"},{"v":3982,"d":"3,982"},{"v":3895,"d":"3,895"},{"v":4091,"d":"4,091"},0,0,0,0,156,122,85,79,{"v":3807,"d":"3,807"},{"v":3898,"d":"3,898"},{"v":3928,"d":"3,928"},{"v":3944,"d":"3,944"},{"v":1957,"d":"1,957"},{"v":1945,"d":"1,945"},{"v":1907,"d":"1,907"},{"v":1869,"d":"1,869"},{"v":2777,"d":"2,777"},{"v":2728,"d":"2,728"},{"v":2592,"d":"2,592"},{"v":2500,"d":"2,500"},{"v":27430,"d":"27,430"},{"v":27.6,"d":"27.60"},{"v":51.2,"d":"51.20"},{"v":222,"d":"222.00"},{"v":22.2,"d":"22.20"},{"v":39.1,"d":"39.10"},{"v":191.5,"d":"191.50"}]
[133,18,{"$f":"IF('iaith - language'!$K$1=2,VLOOKUP(A25,Text!$A$3:$C$353,2,FALSE),VLOOKUP(A25,Text!$A$3:$C$353,3,FALSE))","v":"Caerffili"},213,240,226,280,"N/A",{"v":27738.7809999999,"d":"27,739"},{"v":182059.785609,"d":"182,060"},{"v":1970.325065,"d":"1,970"},{"v":18799.095546,"d":"18,799"},{"v":29970.16474,"d":"29,970"},{"v":11258.469330999998,"d":"11,258"},{"v":20885.838423999998,"d":"20,886"},{"v":148324.086018,"d":"148,324"},{"v":6241.978686,"d":"6,242"},{"v":37900.949961,"d":"37,901"},{"v":107394.45637900001,"d":"107,394"},{"v":144158.83565099997,"d":"144,159"},{"v":133847.75811799997,"d":"133,848"},{"v":48212.02749399999,"d":"48,212"},{"v":4037.244917,"d":"4,037"},{"v":113744.87458200003,"d":"113,745"},{"v":181731,"d":"181,731"},{"v":144061,"d":"144,061"},{"v":35672,"d":"35,672"},null,0,{"v":0,"d":"0.0"},241,{"v":4890,"d":"4,890"},{"v":2030,"d":"2,030"},{"v":27652,"d":"27,652"},{"v":2122,"d":"2,122"},{"v":16714,"d":"16,714"},{"v":15053607.53,"d":"15,053,608"},{"v":331388.8966666665,"d":"331,389"},0,{"v":932.6935815035438,"d":"933"},{"v":1421.469792530034,"d":"1,421"},{"v":6550,"d":"6,550"},{"v":6630,"d":"6,630"},{"v":6475,"d":"6,475"},{"v":6405,"d":"6,405"},{"v":6655,"d":"6,655"},{"v":6560,"d":"6,560"},{"v":6425,"d":"6,425"},{"v":6135,"d":"6,135"},{"v":5735,"d":"5,735"},{"v":5600,"d":"5,600"},{"v":5415,"d":"5,415"},{"v":1289,"d":"1,289"},{"v":1202,"d":"1,202"},{"v":1119,"d":"1,119"},{"v":1053,"d":"1,053"},{"v":1004,"d":"1,004"},{"v":1061,"d":"1,061"},934,844,0,0,0,0,{"v":9997,"d":"9,997"},{"v":10163,"d":"10,163"},{"v":10085,"d":"10,085"},{"v":10625,"d":"10,625"},{"v":1300,"d":"1,300"},{"v":1216,"d":"1,216"},{"v":1130,"d":"1,130"},{"v":1073,"d":"1,073"},{"v":1021,"d":"1,021"},{"v":1082,"d":"1,082"},956,872,{"v":5777,"d":"5,777"},{"v":5743,"d":"5,743"},{"v":5651,"d":"5,651"},{"v":5535,"d":"5,535"},{"v":9857,"d":"9,857"},{"v":10011,"d":"10,011"},{"v":9906,"d":"9,906"},{"v":10436,"d":"10,436"},0,0,0,0,248,197,146,128,{"v":10421,"d":"10,421"},{"v":10594,"d":"10,594"},{"v":10756,"d":"10,756"},{"v":10850,"d":"10,850"},{"v":5777,"d":"5,777"},{"v":5743,"d":"5,743"},{"v":5651,"d":"5,651"},{"v":5535,"d":"5,535"},{"v":8098,"d":"8,098"},{"v":8041,"d":"8,041"},{"v":7737,"d":"7,737"},{"v":7480,"d":"7,480"},{"v":79870,"d":"79,870"},96.75,{"v":217.23000000000002,"d":"217.23"},{"v":858.9000000000001,"d":"858.90"},30.43,{"v":130,"d":"130.00"},{"v":697.2,"d":"697.20"}]
[134,19,{"$f":"IF('iaith - language'!$K$1=2,VLOOKUP(A26,Text!$A$3:$C$353,2,FALSE),VLOOKUP(A26,Text!$A$3:$C$353,3,FALSE))","v":"Blaenau Gwent"},55,76,64,78,"N/A",{"v":10872.805,"d":"10,873"},{"v":69548.184735,"d":"69,548"},{"v":734.197681,"d":"734"},{"v":6824.610459999999,"d":"6,825"},{"v":10831.133041999998,"d":"10,831"},{"v":3978.48218,"d":"3,978"},{"v":7477.479438,"d":"7,477"},{"v":57349.566452,"d":"57,350"},{"v":2301.6672399999998,"d":"2,302"},{"v":13790.240216000002,"d":"13,790"},{"v":41545.91776999999,"d":"41,546"},{"v":55757.944517999975,"d":"55,758"},{"v":50702.08808799999,"d":"50,702"},{"v":18846.096646,"d":"18,846"},{"v":1572.0008189999999,"d":"1,572"},{"v":43996.45732900001,"d":"43,996"},{"v":70020,"d":"70,020"},{"v":56401,"d":"56,401"},{"v":14177,"d":"14,177"},null,0,{"v":0,"d":"0.0"},71,{"v":2170,"d":"2,170"},{"v":1100,"d":"1,100"},{"v":12934,"d":"12,934"},978,{"v":9260,"d":"9,260"},{"v":9814751,"d":"9,814,751"},{"v":312089.00000000064,"d":"312,089"},0,{"v":418.19730596633957,"d":"418"},{"v":574.3173997772794,"d":"574"},{"v":2880,"d":"2,880"},{"v":2865,"d":"2,865"},{"v":2800,"d":"2,800"},{"v":2740,"d":"2,740"},{"v":2860,"d":"2,860"},{"v":2855,"d":"2,855"},{"v":2815,"d":"2,815"},{"v":2700,"d":"2,700"},{"v":2555,"d":"2,555"},{"v":2495,"d":"2,495"},{"v":2450,"d":"2,450"},570,535,500,466,350,364,327,303,0,0,0,0,{"v":4742,"d":"4,742"},{"v":4795,"d":"4,795"},{"v":4743,"d":"4,743"},{"v":4978,"d":"4,978"},573,545,507,471,359,373,340,306,{"v":2560,"d":"2,560"},{"v":2534,"d":"2,534"},{"v":2478,"d":"2,478"},{"v":2421,"d":"2,421"},{"v":4672,"d":"4,672"},{"v":4719,"d":"4,719"},{"v":4654,"d":"4,654"},{"v":4874,"d":"4,874"},0,0,0,0,58,49,55,52,{"v":4581,"d":"4,581"},{"v":4663,"d":"4,663"},{"v":4733,"d":"4,733"},{"v":4756,"d":"4,756"},{"v":2560,"d":"2,560"},{"v":2534,"d":"2,534"},{"v":2478,"d":"2,478"},{"v":2421,"d":"2,421"},{"v":3492,"d":"3,492"},{"v":3452,"d":"3,452"},{"v":3325,"d":"3,325"},{"v":3198,"d":"3,198"},{"v":32870,"d":"32,870"},51.03,67.64,{"v":389.67999999999995,"d":"389.68"},20.19,46.96,387.78]
[135,20,{"$f":"IF('iaith - language'!$K$1=2,VLOOKUP(A27,Text!$A$3:$C$353,2,FALSE),VLOOKUP(A27,Text!$A$3:$C$353,3,FALSE))","v":"Torfaen"},93,126,139,137,"N/A",{"v":12623.993,"d":"12,624"},{"v":94111.15031,"d":"94,111"},{"v":1026.016408,"d":"1,026"},{"v":9927.623627,"d":"9,928"},{"v":15594.931382000002,"d":"15,595"},{"v":5708.362792999999,"d":"5,708"},{"v":10495.871356,"d":"10,496"},{"v":76621.286182,"d":"76,621"},{"v":3198.336898,"d":"3,198"},{"v":19742.752335999998,"d":"19,743"},{"v":54544.304197,"d":"54,544"},{"v":74368.39797700004,"d":"74,368"},{"v":68067.10700199999,"d":"68,067"},{"v":26044.04331099999,"d":"26,044"},{"v":2535.734856,"d":"2,536"},{"v":57881.248299,"d":"57,881"},{"v":94832,"d":"94,832"},{"v":75369,"d":"75,369"},{"v":19543,"d":"19,543"},null,0,{"v":0,"d":"0.0"},118,{"v":2830,"d":"2,830"},{"v":1190,"d":"1,190"},{"v":13632,"d":"13,632"},{"v":1165,"d":"1,165"},{"v":10389,"d":"10,389"},{"v":10130548,"d":"10,130,548"},{"v":238831,"d":"238,831"},0,{"v":495.0979782324445,"d":"495"},{"v":864.3695556335008,"d":"864"},{"v":3475,"d":"3,475"},{"v":3475,"d":"3,475"},{"v":3425,"d":"3,425"},{"v":3405,"d":"3,405"},{"v":3565,"d":"3,565"},{"v":3545,"d":"3,545"},{"v":3465,"d":"3,465"},{"v":3235,"d":"3,235"},{"v":3085,"d":"3,085"},{"v":2995,"d":"2,995"},{"v":2890,"d":"2,890"},492,463,439,409,281,322,270,255,0,0,0,0,{"v":6338,"d":"6,338"},{"v":6401,"d":"6,401"},{"v":6264,"d":"6,264"},{"v":6520,"d":"6,520"},496,465,447,422,281,327,279,259,{"v":2780,"d":"2,780"},{"v":2761,"d":"2,761"},{"v":2720,"d":"2,720"},{"v":2658,"d":"2,658"},{"v":6234,"d":"6,234"},{"v":6285,"d":"6,285"},{"v":6144,"d":"6,144"},{"v":6392,"d":"6,392"},0,0,0,0,66,59,60,57,{"v":5334,"d":"5,334"},{"v":5420,"d":"5,420"},{"v":5482,"d":"5,482"},{"v":5520,"d":"5,520"},{"v":2780,"d":"2,780"},{"v":2761,"d":"2,761"},{"v":2720,"d":"2,720"},{"v":2658,"d":"2,658"},{"v":3557,"d":"3,557"},{"v":3553,"d":"3,553"},{"v":3446,"d":"3,446"},{"v":3339,"d":"3,339"},{"v":42470,"d":"42,470"},{"v":26.3,"d":"26.30"},{"v":101.6,"d":"101.60"},{"v":323.90000000000003,"d":"323.90"},{"v":16.2,"d":"16.20"},{"v":70.8,"d":"70.80"},{"v":290.6,"d":"290.60"}]
[136,21,{"$f":"IF('iaith - language'!$K$1=2,VLOOKUP(A28,Text!$A$3:$C$353,2,FALSE),VLOOKUP(A28,Text!$A$3:$C$353,3,FALSE))","v":"Sir Fynwy"},214,307,283,322,"N/A",{"v":85032.6619999999,"d":"85,033"},{"v":95488.58169,"d":"95,489"},{"v":834.18898,"d":"834"},{"v":8599.377095000002,"d":"8,599"},{"v":14137.256524000002,"d":"14,137"},{"v":5575.421539,"d":"5,575"},{"v":9885.560199000001,"d":"9,886"},{"v":80014.663426,"d":"80,015"},{"v":3135.6003749999995,"d":"3,136"},{"v":17597.340225999997,"d":"17,597"},{"v":52805.416817,"d":"52,805"},{"v":77891.24147,"d":"77,891"},{"v":63337.30410900001,"d":"63,337"},{"v":32151.277587000004,"d":"32,151"},{"v":3478.927407,"d":"3,479"},{"v":56284.383584999996,"d":"56,284"},{"v":95164,"d":"95,164"},{"v":77843,"d":"77,843"},{"v":24340,"d":"24,340"},null,{"v":93511,"d":"93,511"},{"v":0,"d":"0.0"},{"v":1014,"d":"1,014"},{"v":3190,"d":"3,190"},{"v":1220,"d":"1,220"},{"v":10900,"d":"10,900"},{"v":1058,"d":"1,058"},{"v":6168,"d":"6,168"},{"v":7234639,"d":"7,234,639"},{"v":348119.6666666667,"d":"348,120"},0,{"v":1540.2404293141194,"d":"1,540"},{"v":1724.7169712777525,"d":"1,725"},{"v":2155,"d":"2,155"},{"v":2155,"d":"2,155"},{"v":2145,"d":"2,145"},{"v":2120,"d":"2,120"},{"v":2245,"d":"2,245"},{"v":2235,"d":"2,235"},{"v":2175,"d":"2,175"},{"v":2030,"d":"2,030"},{"v":1845,"d":"1,845"},{"v":1800,"d":"1,800"},{"v":1710,"d":"1,710"},242,229,220,207,328,342,273,285,0,0,0,0,{"v":3200,"d":"3,200"},{"v":3242,"d":"3,242"},{"v":3205,"d":"3,205"},{"v":3409,"d":"3,409"},241,236,222,208,344,357,289,303,{"v":1995,"d":"1,995"},{"v":1984,"d":"1,984"},{"v":1987,"d":"1,987"},{"v":1955,"d":"1,955"},{"v":3133,"d":"3,133"},{"v":3167,"d":"3,167"},{"v":3127,"d":"3,127"},{"v":3333,"d":"3,333"},0,0,0,0,77,66,65,65,{"v":2968,"d":"2,968"},{"v":3024,"d":"3,024"},{"v":3047,"d":"3,047"},{"v":3120,"d":"3,120"},{"v":1991,"d":"1,991"},{"v":1983,"d":"1,983"},{"v":1982,"d":"1,982"},{"v":1952,"d":"1,952"},{"v":2580,"d":"2,580"},{"v":2577,"d":"2,577"},{"v":2498,"d":"2,498"},{"v":2466,"d":"2,466"},{"v":42910,"d":"42,910"},{"v":58.7,"d":"58.70"},{"v":611.542,"d":"611.54"},839.02,{"v":14.9,"d":"14.90"},{"v":65.842,"d":"65.84"},{"v":189.9,"d":"189.90"}]
[137,22,{"$f":"IF('iaith - language'!$K$1=2,VLOOKUP(A29,Text!$A$3:$C$353,2,FALSE),VLOOKUP(A29,Text!$A$3:$C$353,3,FALSE))","v":"Casnewydd"},209,270,262,309,"N/A",{"v":19043.11299999991,"d":"19,043"},{"v":158154.047722,"d":"158,154"},{"v":2043.568028,"d":"2,044"},{"v":18988.760578999998,"d":"18,989"},{"v":28944.989913999998,"d":"28,945"},{"v":10232.5778,"d":"10,233"},{"v":18575.611860999998,"d":"18,576"},{"v":124989.585208,"d":"124,990"},{"v":5464.3698460000005,"d":"5,464"},{"v":36856.984320999996,"d":"36,857"},{"v":94073.03117499997,"d":"94,073"},{"v":121297.06340699998,"d":"121,297"},{"v":121577.62066700001,"d":"121,578"},{"v":36576.427060999995,"d":"36,576"},{"v":3457.956201,"d":"3,458"},{"v":99392.12275400003,"d":"99,392"},{"v":156447,"d":"156,447"},{"v":120851,"d":"120,851"},{"v":26654,"d":"26,654"},null,{"v":754568,"d":"754,568"},{"v":0,"d":"0.0"},149,{"v":4510,"d":"4,510"},{"v":1820,"d":"1,820"},{"v":20175,"d":"20,175"},{"v":1699,"d":"1,699"},{"v":13168,"d":"13,168"},{"v":12665258,"d":"12,665,258"},{"v":272960,"d":"272,960"},429,{"v":1698.038146400505,"d":"1,698"},{"v":3879.9599378079147,"d":"3,880"},{"v":7200,"d":"7,200"},{"v":7165,"d":"7,165"},{"v":7075,"d":"7,075"},{"v":7035,"d":"7,035"},{"v":7395,"d":"7,395"},{"v":7365,"d":"7,365"},{"v":7270,"d":"7,270"},{"v":6910,"d":"6,910"},{"v":6590,"d":"6,590"},{"v":6505,"d":"6,505"},{"v":6250,"d":"6,250"},915,858,808,772,711,770,635,581,0,0,0,0,{"v":10351,"d":"10,351"},{"v":10713,"d":"10,713"},{"v":10701,"d":"10,701"},{"v":11354,"d":"11,354"},923,869,823,782,724,785,648,592,{"v":4215,"d":"4,215"},{"v":4157,"d":"4,157"},{"v":4100,"d":"4,100"},{"v":4036,"d":"4,036"},{"v":10212,"d":"10,212"},{"v":10559,"d":"10,559"},{"v":10535,"d":"10,535"},{"v":11182,"d":"11,182"},0,0,0,0,104,95,89,91,{"v":7352,"d":"7,352"},{"v":7447,"d":"7,447"},{"v":7594,"d":"7,594"},{"v":7745,"d":"7,745"},{"v":4215,"d":"4,215"},{"v":4157,"d":"4,157"},{"v":4100,"d":"4,100"},{"v":4036,"d":"4,036"},{"v":5862,"d":"5,862"},{"v":5811,"d":"5,811"},{"v":5571,"d":"5,571"},{"v":5410,"d":"5,410"},{"v":69690,"d":"69,690"},{"v":51.3,"d":"51.30"},{"v":189.10000000000002,"d":"189.10"},417.16,{"v":29.3,"d":"29.30"},{"v":71.8,"d":"71.80"},348.86]
[138,23,{"$f":"IF('iaith - language'!$K$1=2,VLOOKUP(A30,Text!$A$3:$C$353,2,FALSE),VLOOKUP(A30,Text!$A$3:$C$353,3,FALSE))","v":"Caerdydd"},441,627,676,736,"N/A",{"v":14230.3629999999,"d":"14,230"},{"v":368089.900633,"d":"368,090"},{"v":3911.548982,"d":"3,912"},{"v":38610.822702,"d":"38,611"},{"v":59952.720625999995,"d":"59,953"},{"v":21789.606988000003,"d":"21,790"},{"v":50928.287142,"d":"50,928"},{"v":300206.704381,"d":"300,207"},{"v":12415.743599,"d":"12,416"},{"v":75836.82400599998,"d":"75,837"},{"v":238438.126162,"d":"238,438"},{"v":292253.0766310001,"d":"292,253"},{"v":295804.6127560001,"d":"295,805"},{"v":72285.28788099998,"d":"72,285"},{"v":7284.825383,"d":"7,285"},{"v":249787.59215899996,"d":"249,788"},{"v":369202,"d":"369,202"},{"v":293830,"d":"293,830"},{"v":52807,"d":"52,807"},null,{"v":139318,"d":"139,318"},2.4,62,{"v":12690,"d":"12,690"},{"v":4100,"d":"4,100"},{"v":42563,"d":"42,563"},{"v":3142,"d":"3,142"},{"v":31661,"d":"31,661"},{"v":35557841.34,"d":"35,557,841"},{"v":1598360.759999998,"d":"1,598,361"},204,{"v":4804.700708592607,"d":"4,805"},{"v":19296.17765924512,"d":"19,296"},{"v":15600,"d":"15,600"},{"v":15935,"d":"15,935"},{"v":15830,"d":"15,830"},{"v":15510,"d":"15,510"},{"v":16135,"d":"16,135"},{"v":16075,"d":"16,075"},{"v":15810,"d":"15,810"},{"v":15050,"d":"15,050"},{"v":13915,"d":"13,915"},{"v":13430,"d":"13,430"},{"v":12810,"d":"12,810"},{"v":2128,"d":"2,128"},{"v":1993,"d":"1,993"},{"v":1839,"d":"1,839"},{"v":1717,"d":"1,717"},{"v":1495,"d":"1,495"},{"v":1676,"d":"1,676"},{"v":1414,"d":"1,414"},{"v":1234,"d":"1,234"},0,0,0,0,{"v":21464,"d":"21,464"},{"v":22271,"d":"22,271"},{"v":22704,"d":"22,704"},{"v":24024,"d":"24,024"},{"v":2136,"d":"2,136"},{"v":2003,"d":"2,003"},{"v":1854,"d":"1,854"},{"v":1731,"d":"1,731"},{"v":1526,"d":"1,526"},{"v":1707,"d":"1,707"},{"v":1446,"d":"1,446"},{"v":1272,"d":"1,272"},{"v":8289,"d":"8,289"},{"v":8214,"d":"8,214"},{"v":8114,"d":"8,114"},{"v":7932,"d":"7,932"},{"v":21194,"d":"21,194"},{"v":21992,"d":"21,992"},{"v":22381,"d":"22,381"},{"v":23678,"d":"23,678"},0,0,0,0,501,393,272,241,{"v":14520,"d":"14,520"},{"v":14833,"d":"14,833"},{"v":15153,"d":"15,153"},{"v":15363,"d":"15,363"},{"v":8289,"d":"8,289"},{"v":8214,"d":"8,214"},{"v":8114,"d":"8,114"},{"v":7932,"d":"7,932"},{"v":11951,"d":"11,951"},{"v":11924,"d":"11,924"},{"v":11414,"d":"11,414"},{"v":10935,"d":"10,935"},{"v":160640,"d":"160,640"},{"v":92.2,"d":"92.20"},{"v":138.3,"d":"138.30"},{"v":887.6,"d":"887.60"},{"v":58.5,"d":"58.50"},{"v":97.89999999999999,"d":"97.90"},{"v":876.7,"d":"876.70"}]
[]
[139,null,{"$f":"IF('iaith - language'!$K$1=2,VLOOKUP(A32,Text!$A$3:$C$353,2,FALSE),VLOOKUP(A32,Text!$A$3:$C$353,3,FALSE))","v":"Cyfanswm AU "},{"$f":"SUM(D9:D31)","v":{"v":4521,"d":"4,521"}},{"$f":"SUM(E9:E31)","v":{"v":6005,"d":"6,005"}},{"$f":"SUM(F9:F31)","v":{"v":6170,"d":"6,170"}},{"$f":"SUM(G9:G31)","v":{"v":7059,"d":"7,059"}},{"$f":"SUM(H9:H30)","v":0},{"$f":"SUM(I9:I31)","v":{"v":2078260.1919999984,"d":"2,078,260"}},{"$f":"SUM(J9:J30)","v":{"v":3171125.245925,"d":"3,171,125"}},{"v":32934.839741,"d":"32,935"},{"v":320372.603872,"d":"320,373"},{"v":506876.724545,"d":"506,877"},{"v":188654.439549,"d":"188,654"},{"v":368493.91468320024,"d":"368,494"},{"v":2602834.5344829606,"d":"2,602,835"},{"v":106341.12208599999,"d":"106,341"},{"v":639828.9159730395,"d":"639,829"},{"v":1849885.3032211466,"d":"1,849,885"},{"v":2531296.330010961,"d":"2,531,296"},{"v":2281933.580040186,"d":"2,281,934"},{"v":889191.6659438139,"d":"889,192"},{"v":86153.39122999998,"d":"86,153"},{"v":1959832.3410901472,"d":"1,959,832"},{"v":3169586,"d":"3,169,586"},{"v":2539714,"d":"2,539,714"},{"v":668590,"d":"668,590"},0,{"v":1204399,"d":"1,204,399"},{"v":117.61200000000001,"d":"117.61"},{"$f":"SUM(AE9:AE30)","v":{"v":19237,"d":"19,237"}},{"$f":"SUM(AF9:AF30)","v":{"v":114120,"d":"114,120"}},{"$f":"SUM(AG9:AG30)","v":{"v":42630,"d":"42,630"}},{"$f":"SUM(AH9:AH30)","v":{"v":397427,"d":"397,427"}},{"v":37399,"d":"37,399"},{"v":282980,"d":"282,980"},{"v":297542935.62,"d":"297,542,936"},{"$f":"SUM(AL9:AL30)","v":{"v":10938928.54233333,"d":"10,938,929"}},{"v":6176,"d":"6,176"},{"v":107899.93742501315,"d":"107,900"},{"v":71087.85909952383,"d":"71,088"},{"v":110720,"d":"110,720"},{"v":111625,"d":"111,625"},{"v":110215,"d":"110,215"},{"v":108550,"d":"108,550"},{"v":112995,"d":"112,995"},{"v":112150,"d":"112,150"},{"v":109770,"d":"109,770"},{"v":102815,"d":"102,815"},{"v":95055,"d":"95,055"},{"$f":"SUM(AY9:AY30)","v":{"v":92265,"d":"92,265"}},{"$f":"SUM(AZ9:AZ30)","v":{"v":88455,"d":"88,455"}},{"v":17928,"d":"17,928"},{"v":16822,"d":"16,822"},{"v":15676,"d":"15,676"},{"v":14819,"d":"14,819"},{"v":12894,"d":"12,894"},{"v":13995,"d":"13,995"},{"v":11845,"d":"11,845"},{"v":10549,"d":"10,549"},0,0,0,0,{"v":168956,"d":"168,956"},{"v":170772,"d":"170,772"},{"v":169584,"d":"169,584"},{"v":179333,"d":"179,333"},{"v":18080,"d":"18,080"},{"v":17013,"d":"17,013"},{"v":15867,"d":"15,867"},{"v":15007,"d":"15,007"},{"v":13164,"d":"13,164"},{"v":14307,"d":"14,307"},{"v":12202,"d":"12,202"},{"v":10861,"d":"10,861"},{"v":91560,"d":"91,560"},{"v":90592,"d":"90,592"},{"v":89483,"d":"89,483"},{"v":87732,"d":"87,732"},{"v":166199,"d":"166,199"},{"v":167812,"d":"167,812"},{"v":166317,"d":"166,317"},{"v":175784,"d":"175,784"},0,0,0,0,{"v":3837,"d":"3,837"},{"v":3253,"d":"3,253"},{"v":2675,"d":"2,675"},{"v":2529,"d":"2,529"},{"v":146214,"d":"146,214"},{"v":148384,"d":"148,384"},{"v":150286,"d":"150,286"},{"$f":"SUM(CR9:CR30)","v":{"v":151910,"d":"151,910"}},{"v":91551,"d":"91,551"},{"v":90584,"d":"90,584"},{"$f":"SUM(CU9:CU30)","v":{"v":89474,"d":"89,474"}},{"v":87726,"d":"87,726"},{"v":122804,"d":"122,804"},{"v":121912,"d":"121,912"},{"v":117552,"d":"117,552"},{"v":113600,"d":"113,600"},{"$f":"SUM(DA9:DA30)","v":{"v":1454980,"d":"1,454,980"}},{"$f":"SUM(DB9:DB30)","v":{"v":2773.7380000000003,"d":"2,773.74"}},{"$f":"SUM(DC9:DC30)","v":{"v":12865.342000000002,"d":"12,865.34"}},{"v":17667.048,"d":"17,667.05"},{"v":967.3549999999998,"d":"967.36"},{"v":2128.115,"d":"2,128.12"},{"v":8698.067999999997,"d":"8,698.07"}]
[]
[]
[null,27,null,{"$f":"IF('iaith - language'!K1=2,VLOOKUP(B35,Text!$A$3:$C$353,2),VLOOKUP(B35,Text!$A$3:$C$353,3))","v":"Yr Is-adran Polisi Cyllid Llywodraeth Leol a Chynaliadwyedd, Llywodraeth Cymru"}]
[null,30,null,{"$f":"IF('iaith - language'!K1=2,VLOOKUP(B36,Text!$A$3:$C$353,2),VLOOKUP(B36,Text!$A$3:$C$353,3))","v":"Os oes gennych ymholiadau, cysylltwch â:"}]
[null,29,null,"LGFPSettlement@Gov.Wales"]
[]
[null,33,null,{"$f":"IF('iaith - language'!K1=2,VLOOKUP(B39,Text!$A$3:$C$353,2),VLOOKUP(B39,Text!$A$3:$C$353,3))","v":"Nodiadau:"}]
[null,34,null,{"$f":"IF('iaith - language'!K1=2,VLOOKUP(B40,Text!$A$3:$C$353,2),VLOOKUP(B40,Text!$A$3:$C$353,3))","v":"1 Caiff y set ddata hon ei chymryd fel cyfartaledd 3 blynedd yn y setliad."}]
[null,273]

{"sheet":"2021-22 Settlement data","index":5,"n_rows":41,"n_cols":105,"rows_kept":41,"merged":[[5,3,5,6],[5,40,5,50],[5,51,5,54],[5,55,5,58],[5,59,5,62],[5,63,5,66],[5,67,5,70],[5,71,5,74],[5,75,5,78],[5,79,5,82],[5,83,5,86],[5,87,5,90],[5,91,5,94],[5,95,5,98],[5,99,5,102]]}
[null,400,{"$f":"IF('iaith - language'!$K$1=2,VLOOKUP(B1,Text!$A$1:$C$353,2,FALSE),VLOOKUP(B1,Text!$A$1:$C$353,3,FALSE))","v":"Data a ddefnyddiwyd yn Setliad 2021-22 – er gwybodaeth yn unig"}]
[]
[{"$nulls":3},51,{"$nulls":3},61,62,67,68,69,70,71,72,73,74,75,76,77,78,79,80,81,82,83,84,86,90,91,92,145,147,143,149,151,152,160,162,163,192,{"$nulls":10},194,{"$nulls":3},195,{"$nulls":3},196,{"$nulls":3},197,{"$nulls":3},198,{"$nulls":3},199,{"$nulls":3},200,{"$nulls":3},201,{"$nulls":3},202,{"$nulls":3},203,{"$nulls":3},204,{"$nulls":3},205,{"$nulls":3},206,{"$nulls":3},271.5,59]
[{"$nulls":3},401,{"$f":"D4+1","v":402},{"$f":"E4+1","v":403},404,112,405,{"$nulls":20},405,null,404,115,113,{"$nulls":6},407,{"$f":"AO4+1","v":408},{"$f":"AP4+1","v":409},410,411,{"$f":"AO4-3","v":404},{"$f":"AO4-1","v":406},{"$f":"AU4-1","v":405},{"$f":"AS4+1","v":412},{"$f":"AW4+1","v":413},{"$f":"AX4+1","v":414},{"$f":"AY4+1","v":415},{"$f":"AZ4+1","v":416},{"$f":"AP4","v":408},{"$f":"AS4","v":411},{"$f":"AZ4","v":415},{"$f":"BA4","v":416},408,411,415,416,408,411,415,416,408,411,415,416,408,411,415,416,408,411,415,416,408,411,415,416,408,411,415,416,408,411,415,416,408,411,415,416,408,411,415,416,408,411,415,416,408,411,404]
[]
[{"$nulls":3},{"$f":"IF('iaith - language'!$K$1=2,VLOOKUP(D3,Text!$A$3:$C$353,2,FALSE),VLOOKUP(D3,Text!$A$3:$C$353,3,FALSE))","v":"Ceisiadau Cynllunio a Gafwyd"},{"$nulls":3},{"$f":"IF('iaith - language'!$K$1=2,VLOOKUP(H3,Text!$A$3:$C$353,2,FALSE),VLOOKUP(H3,Text!$A$3:$C$353,3,FALSE))","v":"Stoc anheddau'r sector preifat"},{"$f":"IF('iaith - language'!$K$1=2,VLOOKUP(I3,Text!$A$3:$C$353,2,FALSE),VLOOKUP(I3,Text!$A$3:$C$353,3,FALSE))","v":"Arwynebedd tir (hectarau)"},{"$f":"IF('iaith - language'!$K$1=2,VLOOKUP(J3,Text!$A$3:$C$353,2,FALSE),VLOOKUP(J3,Text!$A$3:$C$353,3,FALSE))","v":"Cyfanswm y boblogaeth (amcanestyniad)"},{"$f":"IF('iaith - language'!$K$1=2,VLOOKUP(K3,Text!$A$3:$C$353,2,FALSE),VLOOKUP(K3,Text!$A$3:$C$353,3,FALSE))","v":"Poblogaeth 3 oed (amcanestyniad)"},{"$f":"IF('iaith - language'!$K$1=2,VLOOKUP(L3,Text!$A$3:$C$353,2,FALSE),VLOOKUP(L3,Text!$A$3:$C$353,3,FALSE))","v":"Poblogaeth 3 i 11 oed (amcanestyniad)"},{"$f":"IF('iaith - language'!$K$1=2,VLOOKUP(M3,Text!$A$3:$C$353,2,FALSE),VLOOKUP(M3,Text!$A$3:$C$353,3,FALSE))","v":"Poblogaeth 3 i 16 oed (amcanestyniad)"},{"$f":"IF('iaith - language'!$K$1=2,VLOOKUP(N3,Text!$A$3:$C$353,2,FALSE),VLOOKUP(N3,Text!$A$3:$C$353,3,FALSE))","v":"Poblogaeth 11 i 15 oed (amcanestyniad)"},{"$f":"IF('iaith - language'!$K$1=2,VLOOKUP(O3,Text!$A$3:$C$353,2,FALSE),VLOOKUP(O3,Text!$A$3:$C$353,3,FALSE))","v":"Poblogaeth 11 i 20 oed (amcanestyniad)"},{"$f":"IF('iaith - language'!$K$1=2,VLOOKUP(P3,Text!$A$3:$C$353,2,FALSE),VLOOKUP(P3,Text!$A$3:$C$353,3,FALSE))","v":"Poblogaeth 16 oed a throsodd (amcanestyniad)"},{"$f":"IF('iaith - language'!$K$1=2,VLOOKUP(Q3,Text!$A$3:$C$353,2,FALSE),VLOOKUP(Q3,Text!$A$3:$C$353,3,FALSE))","v":"Poblogaeth 16 i 18 oed (amcanestyniad)"},{"$f":"IF('iaith - language'!$K$1=2,VLOOKUP(R3,Text!$A$3:$C$353,2,FALSE),VLOOKUP(R3,Text!$A$3:$C$353,3,FALSE))","v":"Poblogaeth 0 i 17 oed (amcanestyniad)"},{"$f":"IF('iaith - language'!$K$1=2,VLOOKUP(S3,Text!$A$3:$C$353,2,FALSE),VLOOKUP(S3,Text!$A$3:$C$353,3,FALSE))","v":"Poblogaeth 18 i 64 oed (amcanestyniad)"},{"$f":"IF('iaith - language'!$K$1=2,VLOOKUP(T3,Text!$A$3:$C$353,2,FALSE),VLOOKUP(T3,Text!$A$3:$C$353,3,FALSE))","v":"Poblogaeth 18 oed a throsodd (amcanestyniad)"},{"$f":"IF('iaith - language'!$K$1=2,VLOOKUP(U3,Text!$A$3:$C$353,2,FALSE),VLOOKUP(U3,Text!$A$3:$C$353,3,FALSE))","v":"Poblogaeth o dan 60 oed (amcanestyniad)"},{"$f":"IF('iaith - language'!$K$1=2,VLOOKUP(V3,Text!$A$3:$C$353,2,FALSE),VLOOKUP(V3,Text!$A$3:$C$353,3,FALSE))","v":"Poblogaeth 60 oed a throsodd (amcanestyniad)"},{"$f":"IF('iaith - language'!$K$1=2,VLOOKUP(W3,Text!$A$3:$C$353,2,FALSE),VLOOKUP(W3,Text!$A$3:$C$353,3,FALSE))","v":"Poblogaeth 85 oed a throsodd (amcanestyniad)"},{"$f":"IF('iaith - language'!$K$1=2,VLOOKUP(X3,Text!$A$3:$C$353,2,FALSE),VLOOKUP(X3,Text!$A$3:$C$353,3,FALSE))","v":"Poblogaeth oedran gweithio (16-65G/B) (amcanestyniad)"},{"$f":"IF('iaith - language'!$K$1=2,VLOOKUP(Y3,Text!$A$3:$C$353,2,FALSE),VLOOKUP(Y3,Text!$A$3:$C$353,3,FALSE))","v":"Amcangyfrifon Poblogaeth Ganol Blwyddyn, pob oed"},{"$f":"IF('iaith - language'!$K$1=2,VLOOKUP(Z3,Text!$A$3:$C$353,2,FALSE),VLOOKUP(Z3,Text!$A$3:$C$353,3,FALSE))","v":"Amcangyfrifon Poblogaeth Ganol Blwyddyn, 18 oed a throsodd"},{"$f":"IF('iaith - language'!$K$1=2,VLOOKUP(AA3,Text!$A$3:$C$353,2,FALSE),VLOOKUP(AA3,Text!$A$3:$C$353,3,FALSE))","v":"Amcangyfrifon Poblogaeth Ganol Blwyddyn, 65 oed a throsodd"},{"$f":"IF('iaith - language'!$K$1=2,VLOOKUP(AB3,Text!$A$3:$C$353,2,FALSE),VLOOKUP(AB3,Text!$A$3:$C$353,3,FALSE))","v":"Swm a wariwyd ar grantiau cyfleusterau i'r anabl wedi'u cwblhau (£s)"},{"$f":"IF('iaith - language'!$K$1=2,VLOOKUP(AC3,Text!$A$3:$C$353,2,FALSE),VLOOKUP(AC3,Text!$A$3:$C$353,3,FALSE))","v":"Praeseptau Draenio Tir"},{"$f":"IF('iaith - language'!$K$1=2,VLOOKUP(AD3,Text!$A$3:$C$353,2,FALSE),VLOOKUP(AD3,Text!$A$3:$C$353,3,FALSE))","v":"Hyd yr arfordir a warchodir"},{"$f":"IF('iaith - language'!$K$1=2,VLOOKUP(AE3,Text!$A$3:$C$353,2,FALSE),VLOOKUP(AE3,Text!$A$3:$C$353,3,FALSE))","v":"Nifer y Ffermydd"},{"$f":"IF('iaith - language'!$K$1=2,VLOOKUP(AF3,Text!$A$3:$C$353,2,FALSE),VLOOKUP(AF3,Text!$A$3:$C$353,3,FALSE))","v":"Nifer yr Eiddo Masnachu"},{"$f":"IF('iaith - language'!$K$1=2,VLOOKUP(AG3,Text!$A$3:$C$353,2,FALSE),VLOOKUP(AG3,Text!$A$3:$C$353,3,FALSE))","v":"Nifer yr Eiddo Bwyd"},{"$f":"IF('iaith - language'!$K$1=2,VLOOKUP(AH3,Text!$A$3:$C$353,2,FALSE),VLOOKUP(AH3,Text!$A$3:$C$353,3,FALSE))","v":"Cyfanswm yr unedau goleuadau stryd"},{"$f":"IF('iaith - language'!$K$1=2,VLOOKUP(AI3,Text!$A$3:$C$353,2,FALSE),VLOOKUP(AI3,Text!$A$3:$C$353,3,FALSE))","v":"Nifer y marwolaethau wedi'u cofrestru"},{"$f":"IF('iaith - language'!$K$1=2,VLOOKUP(AJ3,Text!$A$3:$C$353,2,FALSE),VLOOKUP(AJ3,Text!$A$3:$C$353,3,FALSE))","v":"Llwyth achosion Cynlluniau Gostyngiadau'r Dreth Gyngor "},{"$f":"IF('iaith - language'!$K$1=2,VLOOKUP(AK3,Text!$A$3:$C$353,2,FALSE),VLOOKUP(AK3,Text!$A$3:$C$353,3,FALSE))","v":"Gwariant Cynlluniau Gostyngiadau'r Dreth Gyngor"},{"$f":"IF('iaith - language'!$K$1=2,VLOOKUP(AL3,Text!$A$3:$C$353,2,FALSE),VLOOKUP(AL3,Text!$A$3:$C$353,3,FALSE))","v":"Nifer y llongau sy'n cyrraedd porthladdoedd"},{"$f":"IF('iaith - language'!$K$1=2,VLOOKUP(AM3,Text!$A$3:$C$353,2,FALSE),VLOOKUP(AM3,Text!$A$3:$C$353,3,FALSE))","v":"Nosweithiau twristiaid (miloedd) gan gynnwys AirBnb"},{"$f":"IF('iaith - language'!$K$1=2,VLOOKUP(AN3,Text!$A$3:$C$353,2,FALSE),VLOOKUP(AN3,Text!$A$3:$C$353,3,FALSE))","v":"Diwrnodau twristiaid (miloedd)"},{"$f":"IF('iaith - language'!$K$1=2,VLOOKUP(AO3,Text!$A$3:$C$353,2,FALSE),VLOOKUP(AO3,Text!$A$3:$C$353,3,FALSE))","v":"Data Hawlwyr Budd-dal "},{"$nulls":10},{"$f":"IF('iaith - language'!$K$1=2,VLOOKUP(AZ3,Text!$A$3:$C$353,2,FALSE),VLOOKUP(AZ3,Text!$A$3:$C$353,3,FALSE))","v":"Nifer yr Hawlwyr Cymhorthdal Incwm, 18-64 oed"},{"$nulls":3},{"$f":"IF('iaith - language'!$K$1=2,VLOOKUP(BD3,Text!$A$3:$C$353,2,FALSE),VLOOKUP(BD3,Text!$A$3:$C$353,3,FALSE))","v":"Nifer y Derbynwyr Lwfans Ceisio Swydd ar Sail Incwm, 18-64 oed"},{"$nulls":3},{"$f":"IF('iaith - language'!$K$1=2,VLOOKUP(BH3,Text!$A$3:$C$353,2,FALSE),VLOOKUP(BH3,Text!$A$3:$C$353,3,FALSE))","v":"Nifer yr hawlwyr Credyd Pensiwn, 18-64 oed"},{"$nulls":3},{"$f":"IF('iaith - language'!$K$1=2,VLOOKUP(BL3,Text!$A$3:$C$353,2,FALSE),VLOOKUP(BL3,Text!$A$3:$C$353,3,FALSE))","v":"Nifer y rhai sydd yn derbyn Credyd Cynhwysol (ddim mewn cyflogaeth) 18-64 oed"},{"$nulls":3},{"$f":"IF('iaith - language'!$K$1=2,VLOOKUP(BP3,Text!$A$3:$C$353,2,FALSE),VLOOKUP(BP3,Text!$A$3:$C$353,3,FALSE))","v":"Cyfanswm yr Hawlwyr Cymhorthdal Incwm"},{"$nulls":3},{"$f":"IF('iaith - language'!$K$1=2,VLOOKUP(BT3,Text!$A$3:$C$353,2,FALSE),VLOOKUP(BT3,Text!$A$3:$C$353,3,FALSE))","v":"Cyfanswm y Derbynwyr Lwfans Ceisio Swydd ar Sail Incwm"},{"$nulls":3},{"$f":"IF('iaith - language'!$K$1=2,VLOOKUP(BX3,Text!$A$3:$C$353,2,FALSE),VLOOKUP(BX3,Text!$A$3:$C$353,3,FALSE))","v":"Cyfanswm Hawlwyr Credyd Pensiwn"},{"$nulls":3},{"$f":"IF('iaith - language'!$K$1=2,VLOOKUP(CB3,Text!$A$3:$C$353,2,FALSE),VLOOKUP(CB3,Text!$A$3:$C$353,3,FALSE))","v":"Cyfanswm y rhai sy’n derbyn Credyd Cynhwysol (ddim mewn cyflogaeth)"},{"$nulls":3},{"$f":"IF('iaith - language'!$K$1=2,VLOOKUP(CF3,Text!$A$3:$C$353,2,FALSE),VLOOKUP(CF3,Text!$A$3:$C$353,3,FALSE))","v":"Nifer yr Hawlwyr Lwfans Anabledd Difrifol, 18-64 oed"},{"$nulls":3},{"$f":"IF('iaith - language'!$K$1=2,VLOOKUP(CJ3,Text!$A$3:$C$353,2,FALSE),VLOOKUP(CJ3,Text!$A$3:$C$353,3,FALSE))","v":"Nifer yr Hawlwyr Lwfans Byw i'r Anabl, 18-64 oed"},{"$nulls":3},{"$f":"IF('iaith - language'!$K$1=2,VLOOKUP(CN3,Text!$A$3:$C$353,2,FALSE),VLOOKUP(CN3,Text!$A$3:$C$353,3,FALSE))","v":"Nifer yr Hawlwyr Taliad Annibyniaeth Bersonol sydd yn 18-64 oed"},{"$nulls":3},{"$f":"IF('iaith - language'!$K$1=2,VLOOKUP(CR3,Text!$A$3:$C$353,2,FALSE),VLOOKUP(CR3,Text!$A$3:$C$353,3,FALSE))","v":"Hawlwyr Credyd Pensiwn, 65 oed a hŷn "},{"$nulls":3},{"$f":"IF('iaith - language'!$K$1=2,VLOOKUP(CV3,Text!$A$3:$C$353,2,FALSE),VLOOKUP(CV3,Text!$A$3:$C$353,3,FALSE))","v":"Cyfanswn yr hawlwyr Cymhorthdal Incwm, Lwfans Ceisio Gwaith, a Chredyd Pensiwn"},{"$nulls":3},{"$f":"IF('iaith - language'!$K$1=2,VLOOKUP(CZ3,Text!$A$3:$C$353,2,FALSE),VLOOKUP(CZ3,Text!$A$3:$C$353,3,FALSE))","v":"Stoc eiddo treth cyngor"},{"$f":"IF('iaith - language'!$K$1=2,VLOOKUP(DA3,Text!$A$3:$C$353,2,FALSE),VLOOKUP(DA3,Text!$A$3:$C$353,3,FALSE))","v":"Llif traffig (cerbydau)"}]
[null,0,null,{"$f":"IF('iaith - language'!$K$1=2,VLOOKUP(D$4,Text!$A$3:$C$458,2,FALSE),VLOOKUP(D$4,Text!$A$3:$C$458,3,FALSE))","v":"Mehefin 2019"},{"$f":"IF('iaith - language'!$K$1=2,VLOOKUP(E$4,Text!$A$3:$C$458,2,FALSE),VLOOKUP(E$4,Text!$A$3:$C$458,3,FALSE))","v":"Medi 2019"},{"$f":"IF('iaith - language'!$K$1=2,VLOOKUP(F$4,Text!$A$3:$C$458,2,FALSE),VLOOKUP(F$4,Text!$A$3:$C$458,3,FALSE))","v":"Rhagfyr 2019"},{"$f":"IF('iaith - language'!$K$1=2,VLOOKUP(G$4,Text!$A$3:$C$458,2,FALSE),VLOOKUP(G$4,Text!$A$3:$C$458,3,FALSE))","v":"Mawrth 2020"},"2019-20",{"$f":"IF('iaith - language'!$K$1=2,VLOOKUP(I$4,Text!$A$1:$C$458,2,FALSE),VLOOKUP(I$4,Text!$A$1:$C$458,3,FALSE))","v":"Mai 2020"},2021,2021,2021,2021,2021,2021,2021,2021,2021,2021,2021,2021,2021,2021,2021,2019,2019,2019,"2018-19","2020-21",{"$f":"IF('iaith - language'!$K$1=2,VLOOKUP(AD$4,Text!$A$1:$C$458,2,FALSE),VLOOKUP(AD$4,Text!$A$1:$C$458,3,FALSE))","v":"Mai 2020"},2019,{"$f":"IF('iaith - language'!$K$1=2,VLOOKUP(AF$4,Text!$A$1:$C$458,2,FALSE),VLOOKUP(AF$4,Text!$A$1:$C$458,3,FALSE))","v":"Mawrth 2020"},{"$f":"IF('iaith - language'!$K$1=2,VLOOKUP(AG$4,Text!$A$1:$C$458,2,FALSE),VLOOKUP(AG$4,Text!$A$1:$C$458,3,FALSE))","v":{"$error":"#N/A"}},{"$f":"IF('iaith - language'!$K$1=2,VLOOKUP(AH$4,Text!$A$1:$C$458,2,FALSE),VLOOKUP(AH$4,Text!$A$1:$C$458,3,FALSE))","v":{"$error":"#N/A"}},2019,"2019-20","2019-20",2019,2019,2019,{"$f":"IF('iaith - language'!$K$1=2,VLOOKUP(AO$4,Text!$A$1:$C$458,2,FALSE),VLOOKUP(AO$4,Text!$A$1:$C$458,3,FALSE))","v":"Hydref 2019"},{"$f":"IF('iaith - language'!$K$1=2,VLOOKUP(AP$4,Text!$A$1:$C$458,2,FALSE),VLOOKUP(AP$4,Text!$A$1:$C$458,3,FALSE))","v":"Tachwedd 2019"},{"$f":"IF('iaith - language'!$K$1=2,VLOOKUP(AQ$4,Text!$A$1:$C$458,2,FALSE),VLOOKUP(AQ$4,Text!$A$1:$C$458,3,FALSE))","v":"Rhagfyr 2019"},{"$f":"IF('iaith - language'!$K$1=2,VLOOKUP(AR$4,Text!$A$1:$C$458,2,FALSE),VLOOKUP(AR$4,Text!$A$1:$C$458,3,FALSE))","v":"Ionawr 2020"},{"$f":"IF('iaith - language'!$K$1=2,VLOOKUP(AS$4,Text!$A$1:$C$458,2,FALSE),VLOOKUP(AS$4,Text!$A$1:$C$458,3,FALSE))","v":"Chwefror 2020"},{"$f":"IF('iaith - language'!$K$1=2,VLOOKUP(AT$4,Text!$A$1:$C$458,2,FALSE),VLOOKUP(AT$4,Text!$A$1:$C$458,3,FALSE))","v":"Mawrth 2020"},{"$f":"IF('iaith - language'!$K$1=2,VLOOKUP(AU$4,Text!$A$1:$C$458,2,FALSE),VLOOKUP(AU$4,Text!$A$1:$C$458,3,FALSE))","v":"Ebrill 2020"},{"$f":"IF('iaith - language'!$K$1=2,VLOOKUP(AV$4,Text!$A$1:$C$458,2,FALSE),VLOOKUP(AV$4,Text!$A$1:$C$458,3,FALSE))","v":"Mai 2020"},{"$f":"IF('iaith - language'!$K$1=2,VLOOKUP(AW$4,Text!$A$1:$C$458,2,FALSE),VLOOKUP(AW$4,Text!$A$1:$C$458,3,FALSE))","v":"Mehefin 2020"},{"$f":"IF('iaith - language'!$K$1=2,VLOOKUP(AX$4,Text!$A$1:$C$458,2,FALSE),VLOOKUP(AX$4,Text!$A$1:$C$458,3,FALSE))","v":"Gorffennaf 2020"},{"$f":"IF('iaith - language'!$K$1=2,VLOOKUP(AY$4,Text!$A$1:$C$458,2,FALSE),VLOOKUP(AY$4,Text!$A$1:$C$458,3,FALSE))","v":"Awst 2020"},{"$f":"IF('iaith - language'!$K$1=2,VLOOKUP(AZ$4,Text!$A$1:$C$458,2,FALSE),VLOOKUP(AZ$4,Text!$A$1:$C$458,3,FALSE))","v":"Mai 2019"},{"$f":"IF('iaith - language'!$K$1=2,VLOOKUP(BA$4,Text!$A$1:$C$458,2,FALSE),VLOOKUP(BA$4,Text!$A$1:$C$458,3,FALSE))","v":"Awst 2019"},{"$f":"IF('iaith - language'!$K$1=2,VLOOKUP(BB$4,Text!$A$1:$C$458,2,FALSE),VLOOKUP(BB$4,Text!$A$1:$C$458,3,FALSE))","v":"Tachwedd 2019"},{"$f":"IF('iaith - language'!$K$1=2,VLOOKUP(BC$4,Text!$A$1:$C$458,2,FALSE),VLOOKUP(BC$4,Text!$A$1:$C$458,3,FALSE))","v":"Chwefror 2020"},{"$f":"IF('iaith - language'!$K$1=2,VLOOKUP(BD$4,Text!$A$1:$C$458,2,FALSE),VLOOKUP(BD$4,Text!$A$1:$C$458,3,FALSE))","v":"Mai 2019"},{"$f":"IF('iaith - language'!$K$1=2,VLOOKUP(BE$4,Text!$A$1:$C$458,2,FALSE),VLOOKUP(BE$4,Text!$A$1:$C$458,3,FALSE))","v":"Awst 2019"},{"$f":"IF('iaith - language'!$K$1=2,VLOOKUP(BF$4,Text!$A$1:$C$458,2,FALSE),VLOOKUP(BF$4,Text!$A$1:$C$458,3,FALSE))","v":"Tachwedd 2019"},{"$f":"IF('iaith - language'!$K$1=2,VLOOKUP(BG$4,Text!$A$1:$C$458,2,FALSE),VLOOKUP(BG$4,Text!$A$1:$C$458,3,FALSE))","v":"Chwefror 2020"},{"$f":"IF('iaith - language'!$K$1=2,VLOOKUP(BH$4,Text!$A$1:$C$458,2,FALSE),VLOOKUP(BH$4,Text!$A$1:$C$458,3,FALSE))","v":"Mai 2019"},{"$f":"IF('iaith - language'!$K$1=2,VLOOKUP(BI$4,Text!$A$1:$C$458,2,FALSE),VLOOKUP(BI$4,Text!$A$1:$C$458,3,FALSE))","v":"Awst 2019"},{"$f":"IF('iaith - language'!$K$1=2,VLOOKUP(BJ$4,Text!$A$1:$C$458,2,FALSE),VLOOKUP(BJ$4,Text!$A$1:$C$458,3,FALSE))","v":"Tachwedd 2019"},{"$f":"IF('iaith - language'!$K$1=2,VLOOKUP(BK$4,Text!$A$1:$C$458,2,FALSE),VLOOKUP(BK$4,Text!$A$1:$C$458,3,FALSE))","v":"Chwefror 2020"},{"$f":"IF('iaith - language'!$K$1=2,VLOOKUP(BL$4,Text!$A$1:$C$458,2,FALSE),VLOOKUP(BL$4,Text!$A$1:$C$458,3,FALSE))","v":"Mai 2019"},{"$f":"IF('iaith - language'!$K$1=2,VLOOKUP(BM$4,Text!$A$1:$C$458,2,FALSE),VLOOKUP(BM$4,Text!$A$1:$C$458,3,FALSE))","v":"Awst 2019"},{"$f":"IF('iaith - language'!$K$1=2,VLOOKUP(BN$4,Text!$A$1:$C$458,2,FALSE),VLOOKUP(BN$4,Text!$A$1:$C$458,3,FALSE))","v":"Tachwedd 2019"},{"$f":"IF('iaith - language'!$K$1=2,VLOOKUP(BO$4,Text!$A$1:$C$458,2,FALSE),VLOOKUP(BO$4,Text!$A$1:$C$458,3,FALSE))","v":"Chwefror 2020"},{"$f":"IF('iaith - language'!$K$1=2,VLOOKUP(BP$4,Text!$A$1:$C$458,2,FALSE),VLOOKUP(BP$4,Text!$A$1:$C$458,3,FALSE))","v":"Mai 2019"},{"$f":"IF('iaith - language'!$K$1=2,VLOOKUP(BQ$4,Text!$A$1:$C$458,2,FALSE),VLOOKUP(BQ$4,Text!$A$1:$C$458,3,FALSE))","v":"Awst 2019"},{"$f":"IF('iaith - language'!$K$1=2,VLOOKUP(BR$4,Text!$A$1:$C$458,2,FALSE),VLOOKUP(BR$4,Text!$A$1:$C$458,3,FALSE))","v":"Tachwedd 2019"},{"$f":"IF('iaith - language'!$K$1=2,VLOOKUP(BS$4,Text!$A$1:$C$458,2,FALSE),VLOOKUP(BS$4,Text!$A$1:$C$458,3,FALSE))","v":"Chwefror 2020"},{"$f":"IF('iaith - language'!$K$1=2,VLOOKUP(BT$4,Text!$A$1:$C$458,2,FALSE),VLOOKUP(BT$4,Text!$A$1:$C$458,3,FALSE))","v":"Mai 2019"},{"$f":"IF('iaith - language'!$K$1=2,VLOOKUP(BU$4,Text!$A$1:$C$458,2,FALSE),VLOOKUP(BU$4,Text!$A$1:$C$458,3,FALSE))","v":"Awst 2019"},{"$f":"IF('iaith - language'!$K$1=2,VLOOKUP(BV$4,Text!$A$1:$C$458,2,FALSE),VLOOKUP(BV$4,Text!$A$1:$C$458,3,FALSE))","v":"Tachwedd 2019"},{"$f":"IF('iaith - language'!$K$1=2,VLOOKUP(BW$4,Text!$A$1:$C$458,2,FALSE),VLOOKUP(BW$4,Text!$A$1:$C$458,3,FALSE))","v":"Chwefror 2020"},{"$f":"IF('iaith - language'!$K$1=2,VLOOKUP(BX$4,Text!$A$1:$C$458,2,FALSE),VLOOKUP(BX$4,Text!$A$1:$C$458,3,FALSE))","v":"Mai 2019"},{"$f":"IF('iaith - language'!$K$1=2,VLOOKUP(BY$4,Text!$A$1:$C$458,2,FALSE),VLOOKUP(BY$4,Text!$A$1:$C$458,3,FALSE))","v":"Awst 2019"},{"$f":"IF('iaith - language'!$K$1=2,VLOOKUP(BZ$4,Text!$A$1:$C$458,2,FALSE),VLOOKUP(BZ$4,Text!$A$1:$C$458,3,FALSE))","v":"Tachwedd 2019"},{"$f":"IF('iaith - language'!$K$1=2,VLOOKUP(CA$4,Text!$A$1:$C$458,2,FALSE),VLOOKUP(CA$4,Text!$A$1:$C$458,3,FALSE))","v":"Chwefror 2020"},{"$f":"IF('iaith - language'!$K$1=2,VLOOKUP(CB$4,Text!$A$1:$C$458,2,FALSE),VLOOKUP(CB$4,Text!$A$1:$C$458,3,FALSE))","v":"Mai 2019"},{"$f":"IF('iaith - language'!$K$1=2,VLOOKUP(CC$4,Text!$A$1:$C$458,2,FALSE),VLOOKUP(CC$4,Text!$A$1:$C$458,3,FALSE))","v":"Awst 2019"},{"$f":"IF('iaith - language'!$K$1=2,VLOOKUP(CD$4,Text!$A$1:$C$458,2,FALSE),VLOOKUP(CD$4,Text!$A$1:$C$458,3,FALSE))","v":"Tachwedd 2019"},{"$f":"IF('iaith - language'!$K$1=2,VLOOKUP(CE$4,Text!$A$1:$C$458,2,FALSE),VLOOKUP(CE$4,Text!$A$1:$C$458,3,FALSE))","v":"Chwefror 2020"},{"$f":"IF('iaith - language'!$K$1=2,VLOOKUP(CF$4,Text!$A$1:$C$458,2,FALSE),VLOOKUP(CF$4,Text!$A$1:$C$458,3,FALSE))","v":"Mai 2019"},{"$f":"IF('iaith - language'!$K$1=2,VLOOKUP(CG$4,Text!$A$1:$C$458,2,FALSE),VLOOKUP(CG$4,Text!$A$1:$C$458,3,FALSE))","v":"Awst 2019"},{"$f":"IF('iaith - language'!$K$1=2,VLOOKUP(CH$4,Text!$A$1:$C$458,2,FALSE),VLOOKUP(CH$4,Text!$A$1:$C$458,3,FALSE))","v":"Tachwedd 2019"},{"$f":"IF('iaith - language'!$K$1=2,VLOOKUP(CI$4,Text!$A$1:$C$458,2,FALSE),VLOOKUP(CI$4,Text!$A$1:$C$458,3,FALSE))","v":"Chwefror 2020"},{"$f":"IF('iaith - language'!$K$1=2,VLOOKUP(CJ$4,Text!$A$1:$C$458,2,FALSE),VLOOKUP(CJ$4,Text!$A$1:$C$458,3,FALSE))","v":"Mai 2019"},{"$f":"IF('iaith - language'!$K$1=2,VLOOKUP(CK$4,Text!$A$1:$C$458,2,FALSE),VLOOKUP(CK$4,Text!$A$1:$C$458,3,FALSE))","v":"Awst 2019"},{"$f":"IF('iaith - language'!$K$1=2,VLOOKUP(CL$4,Text!$A$1:$C$458,2,FALSE),VLOOKUP(CL$4,Text!$A$1:$C$458,3,FALSE))","v":"Tachwedd 2019"},{"$f":"IF('iaith - language'!$K$1=2,VLOOKUP(CM$4,Text!$A$1:$C$458,2,FALSE),VLOOKUP(CM$4,Text!$A$1:$C$458,3,FALSE))","v":"Chwefror 2020"},{"$f":"IF('iaith - language'!$K$1=2,VLOOKUP(CN$4,Text!$A$1:$C$458,2,FALSE),VLOOKUP(CN$4,Text!$A$1:$C$458,3,FALSE))","v":"Mai 2019"},{"$f":"IF('iaith - language'!$K$1=2,VLOOKUP(CO$4,Text!$A$1:$C$458,2,FALSE),VLOOKUP(CO$4,Text!$A$1:$C$458,3,FALSE))","v":"Awst 2019"},{"$f":"IF('iaith - language'!$K$1=2,VLOOKUP(CP$4,Text!$A$1:$C$458,2,FALSE),VLOOKUP(CP$4,Text!$A$1:$C$458,3,FALSE))","v":"Tachwedd 2019"},{"$f":"IF('iaith - language'!$K$1=2,VLOOKUP(CQ$4,Text!$A$1:$C$458,2,FALSE),VLOOKUP(CQ$4,Text!$A$1:$C$458,3,FALSE))","v":"Chwefror 2020"},{"$f":"IF('iaith - language'!$K$1=2,VLOOKUP(CR$4,Text!$A$1:$C$458,2,FALSE),VLOOKUP(CR$4,Text!$A$1:$C$458,3,FALSE))","v":"Mai 2019"},{"$f":"IF('iaith - language'!$K$1=2,VLOOKUP(CS$4,Text!$A$1:$C$458,2,FALSE),VLOOKUP(CS$4,Text!$A$1:$C$458,3,FALSE))","v":"Awst 2019"},{"$f":"IF('iaith - language'!$K$1=2,VLOOKUP(CT$4,Text!$A$1:$C$458,2,FALSE),VLOOKUP(CT$4,Text!$A$1:$C$458,3,FALSE))","v":"Tachwedd 2019"},{"$f":"IF('iaith - language'!$K$1=2,VLOOKUP(CU$4,Text!$A$1:$C$458,2,FALSE),VLOOKUP(CU$4,Text!$A$1:$C$458,3,FALSE))","v":"Chwefror 2020"},{"$f":"IF('iaith - language'!$K$1=2,VLOOKUP(CV$4,Text!$A$1:$C$458,2,FALSE),VLOOKUP(CV$4,Text!$A$1:$C$458,3,FALSE))","v":"Mai 2019"},{"$f":"IF('iaith - language'!$K$1=2,VLOOKUP(CW$4,Text!$A$1:$C$458,2,FALSE),VLOOKUP(CW$4,Text!$A$1:$C$458,3,FALSE))","v":"Awst 2019"},{"$f":"IF('iaith - language'!$K$1=2,VLOOKUP(CX$4,Text!$A$1:$C$458,2,FALSE),VLOOKUP(CX$4,Text!$A$1:$C$458,3,FALSE))","v":"Tachwedd 2019"},{"$f":"IF('iaith - language'!$K$1=2,VLOOKUP(CY$4,Text!$A$1:$C$458,2,FALSE),VLOOKUP(CY$4,Text!$A$1:$C$458,3,FALSE))","v":"Chwefror 2020"},{"$f":"IF('iaith - language'!$K$1=2,VLOOKUP(CZ$4,Text!$A$1:$C$458,2,FALSE),VLOOKUP(CZ$4,Text!$A$1:$C$458,3,FALSE))","v":"Mawrth 2020"},"2019"]
[]
[117,2,{"$f":"IF('iaith - language'!$K$1=2,VLOOKUP(A9,Text!$A$3:$C$353,2,FALSE),VLOOKUP(A9,Text!$A$3:$C$353,3,FALSE))","v":"Sir Ynys Môn"},232,229,166,228,{"v":30105.640532,"d":"30,106"},{"v":71521.2559999999,"d":"71,521"},{"v":69879.278652,"d":"69,879"},{"v":708.98235,"d":"709"},{"v":6909.511743,"d":"6,910"},{"v":10722.088972000001,"d":"10,722"},{"v":3931.398502,"d":"3,931"},{"v":6962.093315000001,"d":"6,962"},{"v":57767.212897,"d":"57,767"},{"v":2046.9761499999997,"d":"2,047"},{"v":13498.969077000002,"d":"13,499"},{"v":37832.745381,"d":"37,833"},{"v":56380.30957799999,"d":"56,380"},{"v":46086.617701,"d":"46,087"},{"v":23792.660954,"d":"23,793"},{"v":2278.684175,"d":"2,279"},{"v":40237.997748,"d":"40,238"},{"v":70043,"d":"70,043"},{"v":56637,"d":"56,637"},{"v":18358,"d":"18,358"},{"v":511637.34,"d":"511,637"},{"v":3673,"d":"3,673"},7.9,940,{"v":3060,"d":"3,060"},{"v":1030,"d":"1,030"},{"v":9925,"d":"9,925"},803,{"v":5739,"d":"5,739"},{"v":5777761,"d":"5,777,761"},{"v":3108,"d":"3,108"},{"v":4921.001921387871,"d":"4,921"},{"v":707.4918435630126,"d":"707"},{"v":1120,"d":"1,120"},{"v":1195,"d":"1,195"},{"v":1265,"d":"1,265"},{"v":1255,"d":"1,255"},{"v":1340,"d":"1,340"},{"v":1335,"d":"1,335"},{"v":2310,"d":"2,310"},{"v":2615,"d":"2,615"},{"v":2535,"d":"2,535"},{"v":2630,"d":"2,630"},{"v":2635,"d":"2,635"},541,488,442,406,407,339,308,325,0,0,0,0,779,{"v":1034,"d":"1,034"},{"v":1334,"d":"1,334"},{"v":1630,"d":"1,630"},545,496,448,413,412,350,326,334,{"v":2501,"d":"2,501"},{"v":2466,"d":"2,466"},{"v":2432,"d":"2,432"},{"v":2405,"d":"2,405"},784,{"v":1052,"d":"1,052"},{"v":1362,"d":"1,362"},{"v":1663,"d":"1,663"},0,0,0,0,124,119,116,113,{"v":2559,"d":"2,559"},{"v":2585,"d":"2,585"},{"v":2621,"d":"2,621"},{"v":2629,"d":"2,629"},{"v":2501,"d":"2,501"},{"v":2466,"d":"2,466"},{"v":2432,"d":"2,432"},{"v":2405,"d":"2,405"},{"v":3458,"d":"3,458"},{"v":3312,"d":"3,312"},{"v":3206,"d":"3,206"},{"v":3152,"d":"3,152"},{"v":35260,"d":"35,260"},{"v":217272310.113,"d":"217,272,310"}]
[118,3,{"$f":"IF('iaith - language'!$K$1=2,VLOOKUP(A10,Text!$A$3:$C$353,2,FALSE),VLOOKUP(A10,Text!$A$3:$C$353,3,FALSE))","v":"Gwynedd"},240,257,243,245,{"v":53873.044514,"d":"53,873"},{"v":254829.30099999902,"d":"254,829"},{"v":124936.15843,"d":"124,936"},{"v":1171.488919,"d":"1,171"},{"v":11754.988442,"d":"11,755"},{"v":18774.865821,"d":"18,775"},{"v":7146.2271980000005,"d":"7,146"},{"v":15552.531661,"d":"15,553"},{"v":103862.9812,"d":"103,863"},{"v":3906.3122009999997,"d":"3,906"},{"v":23593.103237999996,"d":"23,593"},{"v":72790.619943,"d":"72,791"},{"v":101343.055196,"d":"101,343"},{"v":88241.13602600001,"d":"88,241"},{"v":36695.022408000004,"d":"36,695"},{"v":4037.9185119999993,"d":"4,038"},{"v":76831.74141099997,"d":"76,832"},{"v":124560,"d":"124,560"},{"v":101246,"d":"101,246"},{"v":28380,"d":"28,380"},{"v":621658.9,"d":"621,659"},{"v":118626,"d":"118,626"},{"v":20.137,"d":"20.1"},{"v":1817,"d":"1,817"},{"v":7680,"d":"7,680"},{"v":2520,"d":"2,520"},{"v":17611,"d":"17,611"},{"v":1405,"d":"1,405"},{"v":8978,"d":"8,978"},{"v":9516566,"d":"9,516,566"},2,{"v":18538.117626943345,"d":"18,538"},{"v":3836.383671608743,"d":"3,836"},{"v":1590,"d":"1,590"},{"v":1745,"d":"1,745"},{"v":1830,"d":"1,830"},{"v":1915,"d":"1,915"},{"v":2015,"d":"2,015"},{"v":1985,"d":"1,985"},{"v":3810,"d":"3,810"},{"v":4305,"d":"4,305"},{"v":4215,"d":"4,215"},{"v":4365,"d":"4,365"},{"v":4345,"d":"4,345"},726,647,585,552,492,417,364,352,0,0,0,0,{"v":1160,"d":"1,160"},{"v":1649,"d":"1,649"},{"v":2066,"d":"2,066"},{"v":2635,"d":"2,635"},730,649,587,551,491,425,370,361,{"v":4085,"d":"4,085"},{"v":4038,"d":"4,038"},{"v":4014,"d":"4,014"},{"v":3962,"d":"3,962"},{"v":1192,"d":"1,192"},{"v":1680,"d":"1,680"},{"v":2108,"d":"2,108"},{"v":2684,"d":"2,684"},0,0,0,0,207,197,186,185,{"v":3438,"d":"3,438"},{"v":3457,"d":"3,457"},{"v":3490,"d":"3,490"},{"v":3519,"d":"3,519"},{"v":4085,"d":"4,085"},{"v":4038,"d":"4,038"},{"v":4014,"d":"4,014"},{"v":3962,"d":"3,962"},{"v":5306,"d":"5,306"},{"v":5112,"d":"5,112"},{"v":4971,"d":"4,971"},{"v":4874,"d":"4,874"},{"v":61600,"d":"61,600"},{"v":452803255.263,"d":"452,803,255"}]
[119,4,{"$f":"IF('iaith - language'!$K$1=2,VLOOKUP(A11,Text!$A$3:$C$353,2,FALSE),VLOOKUP(A11,Text!$A$3:$C$353,3,FALSE))","v":"Conwy"},319,221,225,211,{"v":51663.907941,"d":"51,664"},{"v":113017.888,"d":"113,018"},{"v":118000.873222,"d":"118,001"},{"v":1082.677781,"d":"1,083"},{"v":10925.142045,"d":"10,925"},{"v":17323.120191,"d":"17,323"},{"v":6472.672061,"d":"6,473"},{"v":11611.233447,"d":"11,611"},{"v":98782.945152,"d":"98,783"},{"v":3596.490664,"d":"3,596"},{"v":21720.446174,"d":"21,720"},{"v":62992.10718500001,"d":"62,992"},{"v":96280.42704900002,"d":"96,280"},{"v":75869.488505,"d":"75,869"},{"v":42131.38471800001,"d":"42,131"},{"v":5143.979029,"d":"5,144"},{"v":67107.012534,"d":"67,107"},{"v":117203,"d":"117,203"},{"v":95925,"d":"95,925"},{"v":32732,"d":"32,732"},{"v":1008372.2,"d":"1,008,372"},{"v":38951,"d":"38,951"},{"v":23.59,"d":"23.6"},919,{"v":5180,"d":"5,180"},{"v":2210,"d":"2,210"},{"v":16711,"d":"16,711"},{"v":1566,"d":"1,566"},{"v":10103,"d":"10,103"},{"v":10181187,"d":"10,181,187"},74,{"v":10628.436842750845,"d":"10,628"},{"v":7219.659429750646,"d":"7,220"},{"v":2050,"d":"2,050"},{"v":2160,"d":"2,160"},{"v":2220,"d":"2,220"},{"v":2285,"d":"2,285"},{"v":2350,"d":"2,350"},{"v":2335,"d":"2,335"},{"v":4225,"d":"4,225"},{"v":4655,"d":"4,655"},{"v":4620,"d":"4,620"},{"v":4740,"d":"4,740"},{"v":4705,"d":"4,705"},793,714,667,631,470,384,361,372,0,0,0,0,{"v":2291,"d":"2,291"},{"v":2630,"d":"2,630"},{"v":3020,"d":"3,020"},{"v":3462,"d":"3,462"},796,718,674,631,477,397,369,384,{"v":4293,"d":"4,293"},{"v":4235,"d":"4,235"},{"v":4183,"d":"4,183"},{"v":4139,"d":"4,139"},{"v":2322,"d":"2,322"},{"v":2667,"d":"2,667"},{"v":3070,"d":"3,070"},{"v":3527,"d":"3,527"},0,0,0,0,240,229,222,210,{"v":4604,"d":"4,604"},{"v":4639,"d":"4,639"},{"v":4740,"d":"4,740"},{"v":4775,"d":"4,775"},{"v":4289,"d":"4,289"},{"v":4235,"d":"4,235"},{"v":4182,"d":"4,182"},{"v":4139,"d":"4,139"},{"v":5566,"d":"5,566"},{"v":5350,"d":"5,350"},{"v":5226,"d":"5,226"},{"v":5154,"d":"5,154"},{"v":57530,"d":"57,530"},{"v":227310449.852,"d":"227,310,450"}]
[120,5,{"$f":"IF('iaith - language'!$K$1=2,VLOOKUP(A12,Text!$A$3:$C$353,2,FALSE),VLOOKUP(A12,Text!$A$3:$C$353,3,FALSE))","v":"Sir Ddinbych"},227,185,197,195,{"v":37892.567832,"d":"37,893"},{"v":83871.62400000001,"d":"83,872"},{"v":95835.522598,"d":"95,836"},{"v":967.592824,"d":"968"},{"v":9890.130826,"d":"9,890"},{"v":15682.764634,"d":"15,683"},{"v":5875.483223,"d":"5,875"},{"v":10511.820604999999,"d":"10,512"},{"v":78411.093903,"d":"78,411"},{"v":3154.191755,"d":"3,154"},{"v":19582.006755000002,"d":"19,582"},{"v":52515.054106,"d":"52,515"},{"v":76253.51584200001,"d":"76,254"},{"v":65354.29255300001,"d":"65,354"},{"v":30481.230043999993,"d":"30,481"},{"v":2717.1242780000002,"d":"2,717"},{"v":55927.141746999994,"d":"55,927"},{"v":95696,"d":"95,696"},{"v":76246,"d":"76,246"},{"v":23237,"d":"23,237"},{"v":1294656.23,"d":"1,294,656"},0,9.4,759,{"v":3960,"d":"3,960"},{"v":1660,"d":"1,660"},{"v":11572,"d":"11,572"},{"v":1234,"d":"1,234"},{"v":9378,"d":"9,378"},{"v":9938698,"d":"9,938,698"},0,{"v":7261.90875426632,"d":"7,262"},{"v":4400.806284565748,"d":"4,401"},{"v":1855,"d":"1,855"},{"v":1900,"d":"1,900"},{"v":1935,"d":"1,935"},{"v":1995,"d":"1,995"},{"v":2020,"d":"2,020"},{"v":1970,"d":"1,970"},{"v":3395,"d":"3,395"},{"v":3765,"d":"3,765"},{"v":3610,"d":"3,610"},{"v":3780,"d":"3,780"},{"v":3830,"d":"3,830"},856,781,715,674,283,233,211,202,0,0,0,0,{"v":2331,"d":"2,331"},{"v":2751,"d":"2,751"},{"v":3043,"d":"3,043"},{"v":3438,"d":"3,438"},858,788,714,682,285,236,211,216,{"v":3741,"d":"3,741"},{"v":3710,"d":"3,710"},{"v":3674,"d":"3,674"},{"v":3626,"d":"3,626"},{"v":2356,"d":"2,356"},{"v":2780,"d":"2,780"},{"v":3084,"d":"3,084"},{"v":3503,"d":"3,503"},0,0,0,0,257,263,247,237,{"v":4599,"d":"4,599"},{"v":4652,"d":"4,652"},{"v":4732,"d":"4,732"},{"v":4747,"d":"4,747"},{"v":3741,"d":"3,741"},{"v":3710,"d":"3,710"},{"v":3674,"d":"3,674"},{"v":3626,"d":"3,626"},{"v":4884,"d":"4,884"},{"v":4734,"d":"4,734"},{"v":4599,"d":"4,599"},{"v":4524,"d":"4,524"},{"v":45030,"d":"45,030"},{"v":328966614.58599997,"d":"328,966,615"}]
[121,6,{"$f":"IF('iaith - language'!$K$1=2,VLOOKUP(A13,Text!$A$3:$C$353,2,FALSE),VLOOKUP(A13,Text!$A$3:$C$353,3,FALSE))","v":"Sir y Fflint"},281,269,233,274,{"v":58796.825323,"d":"58,797"},{"v":43983.031,"d":"43,983"},{"v":156862.356031,"d":"156,862"},{"v":1655.464437,"d":"1,655"},{"v":16396.144233,"d":"16,396"},{"v":26064.559974000003,"d":"26,065"},{"v":9856.603326,"d":"9,857"},{"v":17650.284237,"d":"17,650"},{"v":127774.678048,"d":"127,775"},{"v":5208.041698,"d":"5,208"},{"v":32698.115749000008,"d":"32,698"},{"v":90437.07488,"d":"90,437"},{"v":124164.24028099999,"d":"124,164"},{"v":113137.65061299999,"d":"113,138"},{"v":43724.705417,"d":"43,725"},{"v":3840.651394,"d":"3,841"},{"v":95831.10319199997,"d":"95,831"},{"v":156100,"d":"156,100"},{"v":123785,"d":"123,785"},{"v":33068,"d":"33,068"},{"v":376519.87,"d":"376,520"},0,{"v":2.31,"d":"2.3"},518,{"v":5070,"d":"5,070"},{"v":1690,"d":"1,690"},{"v":20375,"d":"20,375"},{"v":1546,"d":"1,546"},{"v":10476,"d":"10,476"},{"v":10706747,"d":"10,706,747"},7,{"v":3892.6146782926817,"d":"3,893"},{"v":2929.6085719648577,"d":"2,930"},{"v":2600,"d":"2,600"},{"v":2570,"d":"2,570"},{"v":2580,"d":"2,580"},{"v":2570,"d":"2,570"},{"v":2665,"d":"2,665"},{"v":2620,"d":"2,620"},{"v":4585,"d":"4,585"},{"v":5245,"d":"5,245"},{"v":5065,"d":"5,065"},{"v":5190,"d":"5,190"},{"v":5310,"d":"5,310"},721,663,603,560,288,267,246,263,0,0,0,0,{"v":3821,"d":"3,821"},{"v":4133,"d":"4,133"},{"v":4385,"d":"4,385"},{"v":4767,"d":"4,767"},724,665,605,561,291,271,246,267,{"v":4134,"d":"4,134"},{"v":4079,"d":"4,079"},{"v":4052,"d":"4,052"},{"v":3957,"d":"3,957"},{"v":3871,"d":"3,871"},{"v":4197,"d":"4,197"},{"v":4446,"d":"4,446"},{"v":4852,"d":"4,852"},0,0,0,0,994,819,546,252,{"v":4702,"d":"4,702"},{"v":4969,"d":"4,969"},{"v":5361,"d":"5,361"},{"v":5590,"d":"5,590"},{"v":4134,"d":"4,134"},{"v":4079,"d":"4,079"},{"v":4052,"d":"4,052"},{"v":3957,"d":"3,957"},{"v":5149,"d":"5,149"},{"v":5015,"d":"5,015"},{"v":4903,"d":"4,903"},{"v":4785,"d":"4,785"},{"v":69620,"d":"69,620"},{"v":506912068.588,"d":"506,912,069"}]
[122,7,{"$f":"IF('iaith - language'!$K$1=2,VLOOKUP(A14,Text!$A$3:$C$353,2,FALSE),VLOOKUP(A14,Text!$A$3:$C$353,3,FALSE))","v":"Wrecsam"},204,228,187,183,{"v":47473.260699,"d":"47,473"},{"v":50377.349,"d":"50,377"},{"v":136641.509488,"d":"136,642"},{"v":1531.023648,"d":"1,531"},{"v":14857.623854,"d":"14,858"},{"v":23289.123580999996,"d":"23,289"},{"v":8596.071985999999,"d":"8,596"},{"v":15607.851637368798,"d":"15,608"},{"v":110482.60200611065,"d":"110,483"},{"v":4540.5624259999995,"d":"4,541"},{"v":29271.890086889336,"d":"29,272"},{"v":79447.73237123311,"d":"79,448"},{"v":107369.61940711066,"d":"107,370"},{"v":100413.97309212243,"d":"100,414"},{"v":36227.53640187756,"d":"36,228"},{"v":3409.729123,"d":"3,410"},{"v":84152.0764682331,"d":"84,152"},{"v":135957,"d":"135,957"},{"v":106892,"d":"106,892"},{"v":27438,"d":"27,438"},{"v":1166702.61,"d":"1,166,703"},0,{"v":0,"d":"0.0"},477,{"v":4020,"d":"4,020"},{"v":1450,"d":"1,450"},{"v":13162,"d":"13,162"},{"v":1382,"d":"1,382"},{"v":11104,"d":"11,104"},{"v":10097276,"d":"10,097,276"},0,{"v":1128.1405540158282,"d":"1,128"},{"v":1544.2190134067457,"d":"1,544"},{"v":2585,"d":"2,585"},{"v":2705,"d":"2,705"},{"v":2665,"d":"2,665"},{"v":2650,"d":"2,650"},{"v":2630,"d":"2,630"},{"v":2615,"d":"2,615"},{"v":4520,"d":"4,520"},{"v":5140,"d":"5,140"},{"v":4920,"d":"4,920"},{"v":5055,"d":"5,055"},{"v":5195,"d":"5,195"},981,911,822,771,242,219,195,180,0,0,0,0,{"v":3776,"d":"3,776"},{"v":4117,"d":"4,117"},{"v":4487,"d":"4,487"},{"v":4814,"d":"4,814"},981,915,825,781,240,223,200,186,{"v":3992,"d":"3,992"},{"v":3949,"d":"3,949"},{"v":3893,"d":"3,893"},{"v":3848,"d":"3,848"},{"v":3815,"d":"3,815"},{"v":4172,"d":"4,172"},{"v":4555,"d":"4,555"},{"v":4895,"d":"4,895"},0,0,0,0,276,271,263,248,{"v":5325,"d":"5,325"},{"v":5403,"d":"5,403"},{"v":5502,"d":"5,502"},{"v":5613,"d":"5,613"},{"v":3992,"d":"3,992"},{"v":3949,"d":"3,949"},{"v":3893,"d":"3,893"},{"v":3848,"d":"3,848"},{"v":5213,"d":"5,213"},{"v":5087,"d":"5,087"},{"v":4918,"d":"4,918"},{"v":4815,"d":"4,815"},{"v":60750,"d":"60,750"},{"v":262054458.262,"d":"262,054,458"}]
[123,8,{"$f":"IF('iaith - language'!$K$1=2,VLOOKUP(A15,Text!$A$3:$C$353,2,FALSE),VLOOKUP(A15,Text!$A$3:$C$353,3,FALSE))","v":"Powys"},353,354,371,373,{"v":56297.731371,"d":"56,298"},{"v":519531.10199999897,"d":"519,531"},{"v":132474.726263,"d":"132,475"},{"v":1231.379444,"d":"1,231"},{"v":11794.097382,"d":"11,794"},{"v":19107.354529000004,"d":"19,107"},{"v":7251.273545000001,"d":"7,251"},{"v":13146.220771000002,"d":"13,146"},{"v":111262.42074,"d":"111,262"},{"v":4168.082021,"d":"4,168"},{"v":24079.939300000002,"d":"24,080"},{"v":71302.05979599999,"d":"71,302"},{"v":108394.78696999997,"d":"108,395"},{"v":84902.21896899998,"d":"84,902"},{"v":47572.50730099998,"d":"47,573"},{"v":4939.864962000001,"d":"4,940"},{"v":76150.48178800002,"d":"76,150"},{"v":132435,"d":"132,435"},{"v":108508,"d":"108,508"},{"v":36376,"d":"36,376"},{"v":821412.85,"d":"821,413"},{"v":44427,"d":"44,427"},{"v":0,"d":"0.0"},{"v":3944,"d":"3,944"},{"v":6420,"d":"6,420"},{"v":2520,"d":"2,520"},{"v":15971,"d":"15,971"},{"v":1603,"d":"1,603"},{"v":9404,"d":"9,404"},{"v":9777441,"d":"9,777,441"},0,{"v":8006.526800065309,"d":"8,007"},{"v":3010.7827405707812,"d":"3,011"},{"v":1285,"d":"1,285"},{"v":1335,"d":"1,335"},{"v":1330,"d":"1,330"},{"v":1365,"d":"1,365"},{"v":1420,"d":"1,420"},{"v":1425,"d":"1,425"},{"v":2880,"d":"2,880"},{"v":3635,"d":"3,635"},{"v":3460,"d":"3,460"},{"v":3585,"d":"3,585"},{"v":3710,"d":"3,710"},570,524,469,431,217,207,188,196,0,0,0,0,{"v":1263,"d":"1,263"},{"v":1576,"d":"1,576"},{"v":1921,"d":"1,921"},{"v":2249,"d":"2,249"},577,528,470,431,223,214,190,203,{"v":3890,"d":"3,890"},{"v":3840,"d":"3,840"},{"v":3792,"d":"3,792"},{"v":3735,"d":"3,735"},{"v":1286,"d":"1,286"},{"v":1597,"d":"1,597"},{"v":1955,"d":"1,955"},{"v":2284,"d":"2,284"},0,0,0,0,574,539,412,233,{"v":3874,"d":"3,874"},{"v":3966,"d":"3,966"},{"v":4210,"d":"4,210"},{"v":4338,"d":"4,338"},{"v":3890,"d":"3,890"},{"v":3840,"d":"3,840"},{"v":3792,"d":"3,792"},{"v":3735,"d":"3,735"},{"v":4690,"d":"4,690"},{"v":4582,"d":"4,582"},{"v":4452,"d":"4,452"},{"v":4369,"d":"4,369"},{"v":65030,"d":"65,030"},{"v":265637686.514,"d":"265,637,687"}]
[124,9,{"$f":"IF('iaith - language'!$K$1=2,VLOOKUP(A16,Text!$A$3:$C$353,2,FALSE),VLOOKUP(A16,Text!$A$3:$C$353,3,FALSE))","v":"Sir Ceredigion"},127,218,249,265,{"v":32308.611386,"d":"32,309"},{"v":178837.928,"d":"178,838"},{"v":71490.92708,"d":"71,491"},{"v":608.984704,"d":"609"},{"v":6255.251631000001,"d":"6,255"},{"v":9840.842986000001,"d":"9,841"},{"v":3644.91682,"d":"3,645"},{"v":9733.012798,"d":"9,733"},{"v":60622.902135,"d":"60,623"},{"v":2338.297753,"d":"2,338"},{"v":12311.806075,"d":"12,312"},{"v":40380.62328700001,"d":"40,381"},{"v":59179.121008999995,"d":"59,179"},{"v":47549.956782,"d":"47,550"},{"v":23940.97030200001,"d":"23,941"},{"v":2616.643266,"d":"2,617"},{"v":42848.15500099999,"d":"42,848"},{"v":72695,"d":"72,695"},{"v":60456,"d":"60,456"},{"v":18434,"d":"18,434"},{"v":1239561,"d":"1,239,561"},{"v":11325,"d":"11,325"},{"v":12.915,"d":"12.9"},{"v":1983,"d":"1,983"},{"v":3680,"d":"3,680"},{"v":1390,"d":"1,390"},{"v":6781,"d":"6,781"},790,{"v":5376,"d":"5,376"},{"v":5707209,"d":"5,707,209"},0,{"v":6596.295565071463,"d":"6,596"},{"v":1576.273821438412,"d":"1,576"},770,800,815,820,845,830,{"v":1730,"d":"1,730"},{"v":2010,"d":"2,010"},{"v":1890,"d":"1,890"},{"v":2030,"d":"2,030"},{"v":2045,"d":"2,045"},352,299,259,250,176,139,123,115,0,0,0,0,632,857,{"v":1079,"d":"1,079"},{"v":1350,"d":"1,350"},351,302,266,250,182,149,129,124,{"v":2140,"d":"2,140"},{"v":2123,"d":"2,123"},{"v":2104,"d":"2,104"},{"v":2082,"d":"2,082"},638,867,{"v":1096,"d":"1,096"},{"v":1374,"d":"1,374"},0,0,0,0,327,308,222,82,{"v":2336,"d":"2,336"},{"v":2364,"d":"2,364"},{"v":2508,"d":"2,508"},{"v":2587,"d":"2,587"},{"v":2140,"d":"2,140"},{"v":2123,"d":"2,123"},{"v":2104,"d":"2,104"},{"v":2082,"d":"2,082"},{"v":2673,"d":"2,673"},{"v":2574,"d":"2,574"},{"v":2499,"d":"2,499"},{"v":2456,"d":"2,456"},{"v":35590,"d":"35,590"},{"v":154183531.377,"d":"154,183,531"}]
[125,10,{"$f":"IF('iaith - language'!$K$1=2,VLOOKUP(A17,Text!$A$3:$C$353,2,FALSE),VLOOKUP(A17,Text!$A$3:$C$353,3,FALSE))","v":"Sir Benfro"},244,228,202,284,{"v":54757.336125,"d":"54,757"},{"v":161834.45999999903,"d":"161,834"},{"v":125988.53125,"d":"125,989"},{"v":1161.373109,"d":"1,161"},{"v":12100.175696000002,"d":"12,100"},{"v":19377.573001,"d":"19,378"},{"v":7369.504967,"d":"7,370"},{"v":13282.59865,"d":"13,283"},{"v":104670.004628,"d":"104,670"},{"v":4007.208861,"d":"4,007"},{"v":24066.091748000003,"d":"24,066"},{"v":68248.96038,"d":"68,249"},{"v":101922.43950600001,"d":"101,922"},{"v":83073.68476199999,"d":"83,074"},{"v":42914.84649200001,"d":"42,915"},{"v":4564.739721,"d":"4,565"},{"v":72777.47807900002,"d":"72,777"},{"v":125818,"d":"125,818"},{"v":101871,"d":"101,871"},{"v":32738,"d":"32,738"},{"v":991205.95,"d":"991,206"},0,12.3,{"v":1768,"d":"1,768"},{"v":6800,"d":"6,800"},{"v":2220,"d":"2,220"},{"v":15472,"d":"15,472"},{"v":1524,"d":"1,524"},{"v":10297,"d":"10,297"},{"v":9122193,"d":"9,122,193"},{"v":2595,"d":"2,595"},{"v":13548.598965176589,"d":"13,549"},{"v":2051.6604497195,"d":"2,052"},{"v":1920,"d":"1,920"},{"v":2015,"d":"2,015"},{"v":2085,"d":"2,085"},{"v":2180,"d":"2,180"},{"v":2210,"d":"2,210"},{"v":2225,"d":"2,225"},{"v":4160,"d":"4,160"},{"v":4480,"d":"4,480"},{"v":4330,"d":"4,330"},{"v":4490,"d":"4,490"},{"v":4590,"d":"4,590"},919,834,765,715,537,444,408,385,0,0,0,0,{"v":1916,"d":"1,916"},{"v":2320,"d":"2,320"},{"v":2750,"d":"2,750"},{"v":3337,"d":"3,337"},928,836,774,719,541,450,420,395,{"v":4142,"d":"4,142"},{"v":4077,"d":"4,077"},{"v":4040,"d":"4,040"},{"v":3971,"d":"3,971"},{"v":1941,"d":"1,941"},{"v":2349,"d":"2,349"},{"v":2795,"d":"2,795"},{"v":3396,"d":"3,396"},0,0,0,0,304,298,205,106,{"v":4893,"d":"4,893"},{"v":4982,"d":"4,982"},{"v":5158,"d":"5,158"},{"v":5232,"d":"5,232"},{"v":4142,"d":"4,142"},{"v":4077,"d":"4,077"},{"v":4040,"d":"4,040"},{"v":3971,"d":"3,971"},{"v":5611,"d":"5,611"},{"v":5363,"d":"5,363"},{"v":5234,"d":"5,234"},{"v":5085,"d":"5,085"},{"v":61790,"d":"61,790"},{"v":272411316.598,"d":"272,411,317"}]
[126,11,{"$f":"IF('iaith - language'!$K$1=2,VLOOKUP(A18,Text!$A$3:$C$353,2,FALSE),VLOOKUP(A18,Text!$A$3:$C$353,3,FALSE))","v":"Sir Gaerfyrddin"},357,450,384,366,{"v":76053.127992,"d":"76,053"},{"v":237110.37900000002,"d":"237,110"},{"v":189021.21117,"d":"189,021"},{"v":1934.223463,"d":"1,934"},{"v":19122.325684999996,"d":"19,122"},{"v":30196.325428999997,"d":"30,196"},{"v":11243.988762,"d":"11,244"},{"v":20665.520828,"d":"20,666"},{"v":155371.898729,"d":"155,372"},{"v":6186.557400000001,"d":"6,187"},{"v":37840.197942,"d":"37,840"},{"v":105624.58161999998,"d":"105,625"},{"v":151181.013231,"d":"151,181"},{"v":129956.642398,"d":"129,957"},{"v":59064.56877500001,"d":"59,065"},{"v":5478.0621360000005,"d":"5,478"},{"v":112365.548856,"d":"112,366"},{"v":188771,"d":"188,771"},{"v":151377,"d":"151,377"},{"v":44843,"d":"44,843"},{"v":1807775.08,"d":"1,807,775"},0,{"v":9.06,"d":"9.1"},{"v":3116,"d":"3,116"},{"v":6700,"d":"6,700"},{"v":2690,"d":"2,690"},{"v":20554,"d":"20,554"},{"v":2210,"d":"2,210"},{"v":15787,"d":"15,787"},{"v":15592866.53,"d":"15,592,867"},0,{"v":4180.9132436726695,"d":"4,181"},{"v":2274.59346173275,"d":"2,275"},{"v":2950,"d":"2,950"},{"v":3035,"d":"3,035"},{"v":3020,"d":"3,020"},{"v":3025,"d":"3,025"},{"v":3025,"d":"3,025"},{"v":3045,"d":"3,045"},{"v":5480,"d":"5,480"},{"v":6135,"d":"6,135"},{"v":5940,"d":"5,940"},{"v":6155,"d":"6,155"},{"v":6315,"d":"6,315"},{"v":1376,"d":"1,376"},{"v":1255,"d":"1,255"},{"v":1136,"d":"1,136"},{"v":1060,"d":"1,060"},{"v":1041,"d":"1,041"},876,768,657,0,0,0,0,{"v":2068,"d":"2,068"},{"v":3048,"d":"3,048"},{"v":3799,"d":"3,799"},{"v":4378,"d":"4,378"},{"v":1383,"d":"1,383"},{"v":1265,"d":"1,265"},{"v":1143,"d":"1,143"},{"v":1066,"d":"1,066"},{"v":1042,"d":"1,042"},892,783,673,{"v":6142,"d":"6,142"},{"v":6094,"d":"6,094"},{"v":6025,"d":"6,025"},{"v":5926,"d":"5,926"},{"v":2101,"d":"2,101"},{"v":3089,"d":"3,089"},{"v":3873,"d":"3,873"},{"v":4461,"d":"4,461"},0,0,0,0,557,534,373,185,{"v":8288,"d":"8,288"},{"v":8510,"d":"8,510"},{"v":8867,"d":"8,867"},{"v":9076,"d":"9,076"},{"v":6141,"d":"6,141"},{"v":6094,"d":"6,094"},{"v":6024,"d":"6,024"},{"v":5930,"d":"5,930"},{"v":8567,"d":"8,567"},{"v":8251,"d":"8,251"},{"v":7951,"d":"7,951"},{"v":7665,"d":"7,665"},{"v":88380,"d":"88,380"},{"v":487664913.404,"d":"487,664,913"}]
[127,12,{"$f":"IF('iaith - language'!$K$1=2,VLOOKUP(A19,Text!$A$3:$C$353,2,FALSE),VLOOKUP(A19,Text!$A$3:$C$353,3,FALSE))","v":"Abertawe"},536,568,503,464,{"v":90770.695779,"d":"90,771"},{"v":37761.478999999905,"d":"37,761"},{"v":248586.028716,"d":"248,586"},{"v":2492.200252,"d":"2,492"},{"v":24052.804746,"d":"24,053"},{"v":37530.22853200001,"d":"37,530"},{"v":13568.851526999999,"d":"13,569"},{"v":30700.022797999998,"d":"30,700"},{"v":206181.901172,"d":"206,182"},{"v":8235.295513000001,"d":"8,235"},{"v":47734.998122,"d":"47,735"},{"v":151689.529404,"d":"151,690"},{"v":200851.030594,"d":"200,851"},{"v":184927.468697,"d":"184,927"},{"v":63658.56001900001,"d":"63,659"},{"v":6715.417887,"d":"6,715"},{"v":159652.85232600002,"d":"159,653"},{"v":246993,"d":"246,993"},{"v":200005,"d":"200,005"},{"v":48720,"d":"48,720"},{"v":3211165,"d":"3,211,165"},0,7.9,383,{"v":7480,"d":"7,480"},{"v":2930,"d":"2,930"},{"v":28775,"d":"28,775"},{"v":2510,"d":"2,510"},{"v":22416,"d":"22,416"},{"v":21463457,"d":"21,463,457"},139,{"v":5247.299989960917,"d":"5,247"},{"v":3124.81842892492,"d":"3,125"},{"v":5230,"d":"5,230"},{"v":5215,"d":"5,215"},{"v":5200,"d":"5,200"},{"v":5185,"d":"5,185"},{"v":5320,"d":"5,320"},{"v":5335,"d":"5,335"},{"v":8425,"d":"8,425"},{"v":9300,"d":"9,300"},{"v":8995,"d":"8,995"},{"v":9225,"d":"9,225"},{"v":9485,"d":"9,485"},{"v":1752,"d":"1,752"},{"v":1607,"d":"1,607"},{"v":1497,"d":"1,497"},{"v":1410,"d":"1,410"},732,690,633,664,0,0,0,0,{"v":7264,"d":"7,264"},{"v":7923,"d":"7,923"},{"v":8333,"d":"8,333"},{"v":9191,"d":"9,191"},{"v":1757,"d":"1,757"},{"v":1620,"d":"1,620"},{"v":1508,"d":"1,508"},{"v":1418,"d":"1,418"},740,702,647,676,{"v":7650,"d":"7,650"},{"v":7543,"d":"7,543"},{"v":7488,"d":"7,488"},{"v":7377,"d":"7,377"},{"v":7363,"d":"7,363"},{"v":8028,"d":"8,028"},{"v":8458,"d":"8,458"},{"v":9351,"d":"9,351"},0,0,0,0,704,673,480,228,{"v":11120,"d":"11,120"},{"v":11362,"d":"11,362"},{"v":11802,"d":"11,802"},{"v":12083,"d":"12,083"},{"v":7646,"d":"7,646"},{"v":7540,"d":"7,540"},{"v":7484,"d":"7,484"},{"v":7377,"d":"7,377"},{"v":10147,"d":"10,147"},{"v":9865,"d":"9,865"},{"v":9643,"d":"9,643"},{"v":9471,"d":"9,471"},{"v":113700,"d":"113,700"},{"v":623268564.321,"d":"623,268,564"}]
[128,13,{"$f":"IF('iaith - language'!$K$1=2,VLOOKUP(A20,Text!$A$3:$C$353,2,FALSE),VLOOKUP(A20,Text!$A$3:$C$353,3,FALSE))","v":"Castell-nedd Port Talbot"},216,222,168,203,{"v":53375.961074,"d":"53,376"},{"v":44227.262,"d":"44,227"},{"v":144002.814046,"d":"144,003"},{"v":1502.543274,"d":"1,503"},{"v":14404.671712,"d":"14,405"},{"v":22641.958469,"d":"22,642"},{"v":8220.167816,"d":"8,220"},{"v":15869.764452,"d":"15,870"},{"v":118544.099898,"d":"118,544"},{"v":4654.237267,"d":"4,654"},{"v":28646.890933000002,"d":"28,647"},{"v":85020.400695,"d":"85,020"},{"v":115355.92311999999,"d":"115,356"},{"v":103933.55917,"d":"103,934"},{"v":40069.254882999994,"d":"40,069"},{"v":3504.902948,"d":"3,505"},{"v":89993.588729,"d":"89,994"},{"v":143315,"d":"143,315"},{"v":115254,"d":"115,254"},{"v":29981,"d":"29,981"},{"v":2642266,"d":"2,642,266"},0,2.9,225,{"v":3930,"d":"3,930"},{"v":1790,"d":"1,790"},{"v":19415,"d":"19,415"},{"v":1601,"d":"1,601"},{"v":17011,"d":"17,011"},{"v":17801746,"d":"17,801,746"},165,{"v":858.2275195730402,"d":"858"},{"v":1145.5310161670388,"d":"1,146"},{"v":2945,"d":"2,945"},{"v":3015,"d":"3,015"},{"v":3015,"d":"3,015"},{"v":2970,"d":"2,970"},{"v":2995,"d":"2,995"},{"v":3020,"d":"3,020"},{"v":4955,"d":"4,955"},{"v":5380,"d":"5,380"},{"v":5215,"d":"5,215"},{"v":5285,"d":"5,285"},{"v":5475,"d":"5,475"},{"v":1390,"d":"1,390"},{"v":1305,"d":"1,305"},{"v":1200,"d":"1,200"},{"v":1144,"d":"1,144"},336,315,275,265,0,0,0,0,{"v":4778,"d":"4,778"},{"v":5222,"d":"5,222"},{"v":5631,"d":"5,631"},{"v":6100,"d":"6,100"},{"v":1403,"d":"1,403"},{"v":1312,"d":"1,312"},{"v":1205,"d":"1,205"},{"v":1151,"d":"1,151"},344,321,281,276,{"v":5153,"d":"5,153"},{"v":5092,"d":"5,092"},{"v":5034,"d":"5,034"},{"v":4943,"d":"4,943"},{"v":4826,"d":"4,826"},{"v":5280,"d":"5,280"},{"v":5699,"d":"5,699"},{"v":6181,"d":"6,181"},0,0,0,0,561,537,381,183,{"v":8472,"d":"8,472"},{"v":8594,"d":"8,594"},{"v":8890,"d":"8,890"},{"v":9055,"d":"9,055"},{"v":5153,"d":"5,153"},{"v":5092,"d":"5,092"},{"v":5034,"d":"5,034"},{"v":4943,"d":"4,943"},{"v":6900,"d":"6,900"},{"v":6725,"d":"6,725"},{"v":6520,"d":"6,520"},{"v":6370,"d":"6,370"},{"v":66650,"d":"66,650"},{"v":398746499.717,"d":"398,746,500"}]
[129,14,{"$f":"IF('iaith - language'!$K$1=2,VLOOKUP(A21,Text!$A$3:$C$353,2,FALSE),VLOOKUP(A21,Text!$A$3:$C$353,3,FALSE))","v":"Pen-y-bont ar Ogwr"},220,248,206,236,{"v":55856.893975,"d":"55,857"},{"v":25078.530000000002,"d":"25,079"},{"v":147165.400392,"d":"147,165"},{"v":1593.258419,"d":"1,593"},{"v":15327.006985,"d":"15,327"},{"v":23645.286855,"d":"23,645"},{"v":8368.501262,"d":"8,369"},{"v":15605.902723000001,"d":"15,606"},{"v":120408.783934,"d":"120,409"},{"v":4756.495048,"d":"4,756"},{"v":30001.033257999996,"d":"30,001"},{"v":86706.55166599998,"d":"86,707"},{"v":117164.36713199998,"d":"117,164"},{"v":107287.855582,"d":"107,288"},{"v":39877.544808000006,"d":"39,878"},{"v":3452.0588129999996,"d":"3,452"},{"v":91632.90606900003,"d":"91,633"},{"v":147049,"d":"147,049"},{"v":117680,"d":"117,680"},{"v":29880,"d":"29,880"},{"v":1540971.16,"d":"1,540,971"},0,{"v":2.35,"d":"2.4"},198,{"v":4960,"d":"4,960"},{"v":1790,"d":"1,790"},{"v":19420,"d":"19,420"},{"v":1634,"d":"1,634"},{"v":13155,"d":"13,155"},{"v":14582208,"d":"14,582,208"},0,{"v":2611.6244959119012,"d":"2,612"},{"v":3061.249452487455,"d":"3,061"},{"v":2575,"d":"2,575"},{"v":2580,"d":"2,580"},{"v":2535,"d":"2,535"},{"v":2555,"d":"2,555"},{"v":2635,"d":"2,635"},{"v":2635,"d":"2,635"},{"v":4620,"d":"4,620"},{"v":5230,"d":"5,230"},{"v":5055,"d":"5,055"},{"v":5200,"d":"5,200"},{"v":5325,"d":"5,325"},{"v":1387,"d":"1,387"},{"v":1282,"d":"1,282"},{"v":1154,"d":"1,154"},{"v":1072,"d":"1,072"},276,239,216,220,0,0,0,0,{"v":3308,"d":"3,308"},{"v":3851,"d":"3,851"},{"v":4248,"d":"4,248"},{"v":4870,"d":"4,870"},{"v":1395,"d":"1,395"},{"v":1289,"d":"1,289"},{"v":1163,"d":"1,163"},{"v":1083,"d":"1,083"},274,242,227,218,{"v":4136,"d":"4,136"},{"v":4101,"d":"4,101"},{"v":4053,"d":"4,053"},{"v":3992,"d":"3,992"},{"v":3342,"d":"3,342"},{"v":3901,"d":"3,901"},{"v":4317,"d":"4,317"},{"v":4962,"d":"4,962"},0,0,0,0,{"v":1640,"d":"1,640"},{"v":1243,"d":"1,243"},694,438,{"v":5997,"d":"5,997"},{"v":6526,"d":"6,526"},{"v":7055,"d":"7,055"},{"v":7222,"d":"7,222"},{"v":4136,"d":"4,136"},{"v":4101,"d":"4,101"},{"v":4053,"d":"4,053"},{"v":3992,"d":"3,992"},{"v":5805,"d":"5,805"},{"v":5632,"d":"5,632"},{"v":5443,"d":"5,443"},{"v":5293,"d":"5,293"},{"v":65030,"d":"65,030"},{"v":478016018.71,"d":"478,016,019"}]
[130,15,{"$f":"IF('iaith - language'!$K$1=2,VLOOKUP(A22,Text!$A$3:$C$353,2,FALSE),VLOOKUP(A22,Text!$A$3:$C$353,3,FALSE))","v":"Bro Morgannwg"},362,362,376,393,{"v":52759,"d":"52,759"},{"v":33126.14000000001,"d":"33,126"},{"v":134748.879005,"d":"134,749"},{"v":1472.439566,"d":"1,472"},{"v":14351.264421,"d":"14,351"},{"v":22499.240099,"d":"22,499"},{"v":8274.572359,"d":"8,275"},{"v":14781.583498,"d":"14,782"},{"v":109591.338365,"d":"109,591"},{"v":4516.8206279999995,"d":"4,517"},{"v":28248.130571,"d":"28,248"},{"v":77294.07470999999,"d":"77,294"},{"v":106500.748436,"d":"106,501"},{"v":96656.729439,"d":"96,657"},{"v":38092.14956800001,"d":"38,092"},{"v":3486.380619,"d":"3,486"},{"v":82025.44505499999,"d":"82,025"},{"v":133587,"d":"133,587"},{"v":105935,"d":"105,935"},{"v":28347,"d":"28,347"},{"v":1059562.84,"d":"1,059,563"},0,{"v":4,"d":"4.0"},305,{"v":3390,"d":"3,390"},{"v":1500,"d":"1,500"},{"v":15960,"d":"15,960"},{"v":1333,"d":"1,333"},{"v":9549,"d":"9,549"},{"v":10097254,"d":"10,097,254"},65,{"v":2142.9794345714135,"d":"2,143"},{"v":3669.029081886837,"d":"3,669"},{"v":2040,"d":"2,040"},{"v":2065,"d":"2,065"},{"v":2030,"d":"2,030"},{"v":2065,"d":"2,065"},{"v":2095,"d":"2,095"},{"v":2080,"d":"2,080"},{"v":3865,"d":"3,865"},{"v":4350,"d":"4,350"},{"v":4250,"d":"4,250"},{"v":4405,"d":"4,405"},{"v":4500,"d":"4,500"},965,867,783,733,414,358,288,248,0,0,0,0,{"v":1679,"d":"1,679"},{"v":2194,"d":"2,194"},{"v":2697,"d":"2,697"},{"v":3079,"d":"3,079"},968,867,790,746,420,365,293,249,{"v":3250,"d":"3,250"},{"v":3209,"d":"3,209"},{"v":3170,"d":"3,170"},{"v":3150,"d":"3,150"},{"v":1694,"d":"1,694"},{"v":2222,"d":"2,222"},{"v":2733,"d":"2,733"},{"v":3142,"d":"3,142"},0,0,0,0,{"v":1092,"d":"1,092"},872,489,279,{"v":3790,"d":"3,790"},{"v":4173,"d":"4,173"},{"v":4500,"d":"4,500"},{"v":4699,"d":"4,699"},{"v":3250,"d":"3,250"},{"v":3209,"d":"3,209"},{"v":3170,"d":"3,170"},{"v":3150,"d":"3,150"},{"v":4638,"d":"4,638"},{"v":4441,"d":"4,441"},{"v":4253,"d":"4,253"},{"v":4145,"d":"4,145"},{"v":59830,"d":"59,830"},{"v":356623055.698,"d":"356,623,056"}]
[131,16,{"$f":"IF('iaith - language'!$K$1=2,VLOOKUP(A23,Text!$A$3:$C$353,2,FALSE),VLOOKUP(A23,Text!$A$3:$C$353,3,FALSE))","v":"Rhondda Cynon Taf"},289,273,249,291,{"v":92930.016522,"d":"92,930"},{"v":42415.042,"d":"42,415"},{"v":242158.252746,"d":"242,158"},{"v":2639.763743,"d":"2,640"},{"v":25619.062380000003,"d":"25,619"},{"v":39981.12138700001,"d":"39,981"},{"v":14529.107692,"d":"14,529"},{"v":28036.886505,"d":"28,037"},{"v":197024.334161,"d":"197,024"},{"v":8041.150345,"d":"8,041"},{"v":50505.65029100001,"d":"50,506"},{"v":144663.16725300002,"d":"144,663"},{"v":191652.60245499996,"d":"191,653"},{"v":180545.44368500003,"d":"180,545"},{"v":61612.809061,"d":"61,613"},{"v":5440.689738,"d":"5,441"},{"v":152605.725585,"d":"152,606"},{"v":241264,"d":"241,264"},{"v":191160,"d":"191,160"},{"v":46628,"d":"46,628"},{"v":3553848.4,"d":"3,553,848"},0,{"v":0,"d":"0.0"},272,{"v":6660,"d":"6,660"},{"v":3060,"d":"3,060"},{"v":29724,"d":"29,724"},{"v":2611,"d":"2,611"},{"v":24747,"d":"24,747"},{"v":24441288,"d":"24,441,288"},0,{"v":1227.4962032365697,"d":"1,227"},{"v":1575.144551455473,"d":"1,575"},{"v":4605,"d":"4,605"},{"v":4735,"d":"4,735"},{"v":4750,"d":"4,750"},{"v":4760,"d":"4,760"},{"v":4845,"d":"4,845"},{"v":4785,"d":"4,785"},{"v":8760,"d":"8,760"},{"v":10010,"d":"10,010"},{"v":9555,"d":"9,555"},{"v":9665,"d":"9,665"},{"v":9995,"d":"9,995"},{"v":2758,"d":"2,758"},{"v":2531,"d":"2,531"},{"v":2294,"d":"2,294"},{"v":2146,"d":"2,146"},{"v":1201,"d":"1,201"},{"v":1052,"d":"1,052"},851,774,0,0,0,0,{"v":4067,"d":"4,067"},{"v":5383,"d":"5,383"},{"v":6338,"d":"6,338"},{"v":7458,"d":"7,458"},{"v":2780,"d":"2,780"},{"v":2541,"d":"2,541"},{"v":2305,"d":"2,305"},{"v":2153,"d":"2,153"},{"v":1218,"d":"1,218"},{"v":1066,"d":"1,066"},863,787,{"v":8230,"d":"8,230"},{"v":8131,"d":"8,131"},{"v":8018,"d":"8,018"},{"v":7885,"d":"7,885"},{"v":4105,"d":"4,105"},{"v":5447,"d":"5,447"},{"v":6419,"d":"6,419"},{"v":7552,"d":"7,552"},0,0,0,0,{"v":2936,"d":"2,936"},{"v":2344,"d":"2,344"},{"v":1421,"d":"1,421"},833,{"v":10551,"d":"10,551"},{"v":11463,"d":"11,463"},{"v":12464,"d":"12,464"},{"v":12866,"d":"12,866"},{"v":8230,"d":"8,230"},{"v":8131,"d":"8,131"},{"v":8018,"d":"8,018"},{"v":7885,"d":"7,885"},{"v":12228,"d":"12,228"},{"v":11738,"d":"11,738"},{"v":11186,"d":"11,186"},{"v":10825,"d":"10,825"},{"v":109980,"d":"109,980"},{"v":731830938.195,"d":"731,830,938"}]
[132,17,{"$f":"IF('iaith - language'!$K$1=2,VLOOKUP(A24,Text!$A$3:$C$353,2,FALSE),VLOOKUP(A24,Text!$A$3:$C$353,3,FALSE))","v":"Merthyr Tudful"},94,94,74,80,{"v":21274.337218,"d":"21,274"},{"v":11195.7019999999,"d":"11,196"},{"v":60751.274353,"d":"60,751"},{"v":728.129696,"d":"728"},{"v":6800.7604249999995,"d":"6,801"},{"v":10392.609509000002,"d":"10,393"},{"v":3657.4931260000003,"d":"3,657"},{"v":6732.520826,"d":"6,733"},{"v":48886.38526,"d":"48,886"},{"v":1950.7435409999998,"d":"1,951"},{"v":13152.802062000004,"d":"13,153"},{"v":36060.08570799999,"d":"36,060"},{"v":47598.472292999984,"d":"47,598"},{"v":45305.507068000006,"d":"45,306"},{"v":15445.767287000002,"d":"15,446"},{"v":1283.566374,"d":"1,284"},{"v":38004.356618999984,"d":"38,004"},{"v":60326,"d":"60,326"},{"v":47469,"d":"47,469"},{"v":11386,"d":"11,386"},{"v":607332.77,"d":"607,333"},0,{"v":0,"d":"0.0"},49,{"v":1760,"d":"1,760"},780,{"v":7475,"d":"7,475"},640,{"v":6297,"d":"6,297"},{"v":6234442,"d":"6,234,442"},0,{"v":494.1395128633452,"d":"494"},{"v":1297.175335681343,"d":"1,297"},{"v":1465,"d":"1,465"},{"v":1500,"d":"1,500"},{"v":1510,"d":"1,510"},{"v":1495,"d":"1,495"},{"v":1455,"d":"1,455"},{"v":1425,"d":"1,425"},{"v":2480,"d":"2,480"},{"v":2745,"d":"2,745"},{"v":2630,"d":"2,630"},{"v":2705,"d":"2,705"},{"v":2740,"d":"2,740"},698,635,579,549,273,206,225,206,0,0,0,0,{"v":1641,"d":"1,641"},{"v":1977,"d":"1,977"},{"v":2222,"d":"2,222"},{"v":2477,"d":"2,477"},702,637,579,551,275,205,229,208,{"v":2094,"d":"2,094"},{"v":2065,"d":"2,065"},{"v":2044,"d":"2,044"},{"v":2003,"d":"2,003"},{"v":1657,"d":"1,657"},{"v":1997,"d":"1,997"},{"v":2252,"d":"2,252"},{"v":2513,"d":"2,513"},0,0,0,0,860,694,437,287,{"v":2916,"d":"2,916"},{"v":3179,"d":"3,179"},{"v":3473,"d":"3,473"},{"v":3597,"d":"3,597"},{"v":2094,"d":"2,094"},{"v":2065,"d":"2,065"},{"v":2044,"d":"2,044"},{"v":2003,"d":"2,003"},{"v":3071,"d":"3,071"},{"v":2907,"d":"2,907"},{"v":2852,"d":"2,852"},{"v":2762,"d":"2,762"},{"v":27440,"d":"27,440"},{"v":65692802.864,"d":"65,692,803"}]
[133,18,{"$f":"IF('iaith - language'!$K$1=2,VLOOKUP(A25,Text!$A$3:$C$353,2,FALSE),VLOOKUP(A25,Text!$A$3:$C$353,3,FALSE))","v":"Caerffili"},263,204,194,232,{"v":64599.106554,"d":"64,599"},{"v":27738.7809999999,"d":"27,739"},{"v":181845.637973,"d":"181,846"},{"v":1970.901585,"d":"1,971"},{"v":19134.269014,"d":"19,134"},{"v":29996.021603999998,"d":"29,996"},{"v":11181.787194,"d":"11,182"},{"v":20713.828353000004,"d":"20,714"},{"v":147959.40535000002,"d":"147,959"},{"v":6181.716252,"d":"6,182"},{"v":38035.552422999994,"d":"38,036"},{"v":107564.42868699996,"d":"107,564"},{"v":143810.0855509999,"d":"143,810"},{"v":134303.72336299997,"d":"134,304"},{"v":47541.914611,"d":"47,542"},{"v":3973.2472839999996,"d":"3,973"},{"v":113802.29987900003,"d":"113,802"},{"v":181075,"d":"181,075"},{"v":143125,"d":"143,125"},{"v":35549,"d":"35,549"},{"v":862496.23,"d":"862,496"},0,{"v":0,"d":"0.0"},243,{"v":4710,"d":"4,710"},{"v":2050,"d":"2,050"},{"v":27653,"d":"27,653"},{"v":1803,"d":"1,803"},{"v":16720,"d":"16,720"},{"v":13784522,"d":"13,784,522"},0,{"v":920.860305936848,"d":"921"},{"v":1421.469792530034,"d":"1,421"},{"v":3610,"d":"3,610"},{"v":3615,"d":"3,615"},{"v":3550,"d":"3,550"},{"v":3495,"d":"3,495"},{"v":3640,"d":"3,640"},{"v":3630,"d":"3,630"},{"v":6240,"d":"6,240"},{"v":7000,"d":"7,000"},{"v":6790,"d":"6,790"},{"v":7005,"d":"7,005"},{"v":7115,"d":"7,115"},{"v":1827,"d":"1,827"},{"v":1660,"d":"1,660"},{"v":1501,"d":"1,501"},{"v":1391,"d":"1,391"},914,807,651,657,0,0,0,0,{"v":3614,"d":"3,614"},{"v":4472,"d":"4,472"},{"v":5103,"d":"5,103"},{"v":5840,"d":"5,840"},{"v":1836,"d":"1,836"},{"v":1665,"d":"1,665"},{"v":1507,"d":"1,507"},{"v":1399,"d":"1,399"},926,814,668,669,{"v":6128,"d":"6,128"},{"v":6068,"d":"6,068"},{"v":5985,"d":"5,985"},{"v":5899,"d":"5,899"},{"v":3659,"d":"3,659"},{"v":4521,"d":"4,521"},{"v":5172,"d":"5,172"},{"v":5931,"d":"5,931"},0,0,0,0,{"v":1762,"d":"1,762"},{"v":1376,"d":"1,376"},726,404,{"v":8556,"d":"8,556"},{"v":9183,"d":"9,183"},{"v":9793,"d":"9,793"},{"v":10010,"d":"10,010"},{"v":6128,"d":"6,128"},{"v":6068,"d":"6,068"},{"v":5985,"d":"5,985"},{"v":5899,"d":"5,899"},{"v":8890,"d":"8,890"},{"v":8547,"d":"8,547"},{"v":8160,"d":"8,160"},{"v":7967,"d":"7,967"},{"v":79560,"d":"79,560"},{"v":539912462.09,"d":"539,912,462"}]
[134,19,{"$f":"IF('iaith - language'!$K$1=2,VLOOKUP(A26,Text!$A$3:$C$353,2,FALSE),VLOOKUP(A26,Text!$A$3:$C$353,3,FALSE))","v":"Blaenau Gwent"},83,94,76,74,{"v":24992.941922,"d":"24,993"},{"v":10872.805,"d":"10,873"},{"v":69583.402218,"d":"69,583"},{"v":743.852589,"d":"744"},{"v":6922.742498,"d":"6,923"},{"v":10827.450033,"d":"10,827"},{"v":3983.903649,"d":"3,984"},{"v":7382.862657000001,"d":"7,383"},{"v":57286.86649,"d":"57,287"},{"v":2162.752458,"d":"2,163"},{"v":13767.270523,"d":"13,767"},{"v":41734.11058899998,"d":"41,734"},{"v":55816.13170099998,"d":"55,816"},{"v":51007.05687199999,"d":"51,007"},{"v":18576.345352000004,"d":"18,576"},{"v":1542.881434,"d":"1,543"},{"v":43994.515214,"d":"43,995"},{"v":69862,"d":"69,862"},{"v":56285,"d":"56,285"},{"v":14192,"d":"14,192"},{"v":241022.71,"d":"241,023"},0,{"v":0,"d":"0.0"},71,{"v":2110,"d":"2,110"},{"v":1080,"d":"1,080"},{"v":12936,"d":"12,936"},796,{"v":8892,"d":"8,892"},{"v":8988272,"d":"8,988,272"},0,{"v":385.87708102989535,"d":"386"},{"v":558.2327692332735,"d":"558"},{"v":1660,"d":"1,660"},{"v":1725,"d":"1,725"},{"v":1705,"d":"1,705"},{"v":1665,"d":"1,665"},{"v":1740,"d":"1,740"},{"v":1750,"d":"1,750"},{"v":2785,"d":"2,785"},{"v":3135,"d":"3,135"},{"v":3115,"d":"3,115"},{"v":3140,"d":"3,140"},{"v":3120,"d":"3,120"},792,733,649,605,340,287,245,229,0,0,0,0,{"v":1896,"d":"1,896"},{"v":2285,"d":"2,285"},{"v":2599,"d":"2,599"},{"v":2997,"d":"2,997"},791,734,655,610,346,292,251,239,{"v":2730,"d":"2,730"},{"v":2705,"d":"2,705"},{"v":2676,"d":"2,676"},{"v":2613,"d":"2,613"},{"v":1918,"d":"1,918"},{"v":2320,"d":"2,320"},{"v":2638,"d":"2,638"},{"v":3039,"d":"3,039"},0,0,0,0,440,362,143,80,{"v":3935,"d":"3,935"},{"v":4148,"d":"4,148"},{"v":4375,"d":"4,375"},{"v":4437,"d":"4,437"},{"v":2730,"d":"2,730"},{"v":2705,"d":"2,705"},{"v":2676,"d":"2,676"},{"v":2613,"d":"2,613"},{"v":3867,"d":"3,867"},{"v":3731,"d":"3,731"},{"v":3582,"d":"3,582"},{"v":3462,"d":"3,462"},{"v":32760,"d":"32,760"},{"v":190681332.441,"d":"190,681,332"}]
[135,20,{"$f":"IF('iaith - language'!$K$1=2,VLOOKUP(A27,Text!$A$3:$C$353,2,FALSE),VLOOKUP(A27,Text!$A$3:$C$353,3,FALSE))","v":"Torfaen"},149,134,119,115,{"v":32151,"d":"32,151"},{"v":12623.993,"d":"12,624"},{"v":93855.644994,"d":"93,856"},{"v":1019.96998,"d":"1,020"},{"v":10021.85383,"d":"10,022"},{"v":15612.202936,"d":"15,612"},{"v":5650.807804,"d":"5,651"},{"v":10289.430112999999,"d":"10,289"},{"v":76322.010421,"d":"76,322"},{"v":3027.7013500000003,"d":"3,028"},{"v":19612.898547999997,"d":"19,613"},{"v":54632.10745599998,"d":"54,632"},{"v":74242.746447,"d":"74,243"},{"v":68237.49133299998,"d":"68,237"},{"v":25618.153662,"d":"25,618"},{"v":2521.437605,"d":"2,521"},{"v":57778.55345999999,"d":"57,779"},{"v":93961,"d":"93,961"},{"v":74510,"d":"74,510"},{"v":19336,"d":"19,336"},{"v":1093186.34,"d":"1,093,186"},0,{"v":0,"d":"0.0"},119,{"v":2780,"d":"2,780"},{"v":1200,"d":"1,200"},{"v":13622,"d":"13,622"},{"v":1016,"d":"1,016"},{"v":10074,"d":"10,074"},{"v":9282004,"d":"9,282,004"},0,{"v":474.6874508689689,"d":"475"},{"v":886.7812213647607,"d":"887"},{"v":1955,"d":"1,955"},{"v":2020,"d":"2,020"},{"v":1995,"d":"1,995"},{"v":1955,"d":"1,955"},{"v":2025,"d":"2,025"},{"v":2035,"d":"2,035"},{"v":3360,"d":"3,360"},{"v":3755,"d":"3,755"},{"v":3600,"d":"3,600"},{"v":3720,"d":"3,720"},{"v":3830,"d":"3,830"},637,585,545,519,112,111,105,126,0,0,0,0,{"v":3417,"d":"3,417"},{"v":3685,"d":"3,685"},{"v":3934,"d":"3,934"},{"v":4191,"d":"4,191"},637,586,550,520,112,109,107,127,{"v":2960,"d":"2,960"},{"v":2901,"d":"2,901"},{"v":2869,"d":"2,869"},{"v":2830,"d":"2,830"},{"v":3462,"d":"3,462"},{"v":3725,"d":"3,725"},{"v":3983,"d":"3,983"},{"v":4251,"d":"4,251"},0,0,0,0,508,418,154,89,{"v":4570,"d":"4,570"},{"v":4850,"d":"4,850"},{"v":5105,"d":"5,105"},{"v":5203,"d":"5,203"},{"v":2960,"d":"2,960"},{"v":2901,"d":"2,901"},{"v":2869,"d":"2,869"},{"v":2830,"d":"2,830"},{"v":3709,"d":"3,709"},{"v":3596,"d":"3,596"},{"v":3526,"d":"3,526"},{"v":3477,"d":"3,477"},{"v":42260,"d":"42,260"},{"v":168657493.521,"d":"168,657,494"}]
[136,21,{"$f":"IF('iaith - language'!$K$1=2,VLOOKUP(A28,Text!$A$3:$C$353,2,FALSE),VLOOKUP(A28,Text!$A$3:$C$353,3,FALSE))","v":"Sir Fynwy"},310,307,276,241,{"v":36781.106581,"d":"36,781"},{"v":85032.662,"d":"85,033"},{"v":95133.568524,"d":"95,134"},{"v":812.257849,"d":"812"},{"v":8670.302203000001,"d":"8,670"},{"v":14144.113549000003,"d":"14,144"},{"v":5467.126759,"d":"5,467"},{"v":9787.878982999999,"d":"9,788"},{"v":79669.14992,"d":"79,669"},{"v":3123.256133,"d":"3,123"},{"v":17609.639414999998,"d":"17,610"},{"v":52892.88451999999,"d":"52,893"},{"v":77523.92910999997,"d":"77,524"},{"v":63691.25797299999,"d":"63,691"},{"v":31442.310552,"d":"31,442"},{"v":3412.2475090000003,"d":"3,412"},{"v":56270.69834200001,"d":"56,271"},{"v":94590,"d":"94,590"},{"v":77230,"d":"77,230"},{"v":23891,"d":"23,891"},{"v":531579.9,"d":"531,580"},{"v":93511,"d":"93,511"},{"v":0,"d":"0.0"},{"v":1031,"d":"1,031"},{"v":3130,"d":"3,130"},{"v":1230,"d":"1,230"},{"v":10900,"d":"10,900"},990,{"v":5780,"d":"5,780"},{"v":6410233,"d":"6,410,233"},0,{"v":1338.0903785862017,"d":"1,338"},{"v":1724.7169712777525,"d":"1,725"},950,950,970,965,980,975,{"v":2035,"d":"2,035"},{"v":2345,"d":"2,345"},{"v":2260,"d":"2,260"},{"v":2320,"d":"2,320"},{"v":2395,"d":"2,395"},357,324,289,261,194,183,161,173,0,0,0,0,{"v":1116,"d":"1,116"},{"v":1284,"d":"1,284"},{"v":1425,"d":"1,425"},{"v":1625,"d":"1,625"},356,325,289,261,211,196,176,187,{"v":2066,"d":"2,066"},{"v":2055,"d":"2,055"},{"v":2041,"d":"2,041"},{"v":2025,"d":"2,025"},{"v":1130,"d":"1,130"},{"v":1302,"d":"1,302"},{"v":1446,"d":"1,446"},{"v":1657,"d":"1,657"},0,0,0,0,364,269,117,87,{"v":2614,"d":"2,614"},{"v":2757,"d":"2,757"},{"v":2876,"d":"2,876"},{"v":2909,"d":"2,909"},{"v":2061,"d":"2,061"},{"v":2055,"d":"2,055"},{"v":2037,"d":"2,037"},{"v":2023,"d":"2,023"},{"v":2633,"d":"2,633"},{"v":2576,"d":"2,576"},{"v":2506,"d":"2,506"},{"v":2473,"d":"2,473"},{"v":42630,"d":"42,630"},{"v":149785898.961,"d":"149,785,899"}]
[137,22,{"$f":"IF('iaith - language'!$K$1=2,VLOOKUP(A29,Text!$A$3:$C$353,2,FALSE),VLOOKUP(A29,Text!$A$3:$C$353,3,FALSE))","v":"Casnewydd"},281,241,284,276,{"v":55328.324851,"d":"55,328"},{"v":19043.11299999991,"d":"19,043"},{"v":156971.962429,"d":"156,972"},{"v":2013.192834,"d":"2,013"},{"v":18872.024933,"d":"18,872"},{"v":28570.712594000004,"d":"28,571"},{"v":9922.995538000001,"d":"9,923"},{"v":18163.89094,"d":"18,164"},{"v":124167.783885,"d":"124,168"},{"v":5345.164058,"d":"5,345"},{"v":36432.054834999995,"d":"36,432"},{"v":93626.38571299997,"d":"93,626"},{"v":120539.90759499995,"d":"120,540"},{"v":120975.29393900002,"d":"120,975"},{"v":35996.668491000004,"d":"35,997"},{"v":3382.146952,"d":"3,382"},{"v":98724.85544999997,"d":"98,725"},{"v":154676,"d":"154,676"},{"v":119331,"d":"119,331"},{"v":26670,"d":"26,670"},{"v":692436.42,"d":"692,436"},{"v":754568,"d":"754,568"},{"v":0,"d":"0.0"},150,{"v":4530,"d":"4,530"},{"v":1860,"d":"1,860"},{"v":19832,"d":"19,832"},{"v":1440,"d":"1,440"},{"v":13260,"d":"13,260"},{"v":11234252,"d":"11,234,252"},491,{"v":1648.5525557549186,"d":"1,649"},{"v":3879.9599378079147,"d":"3,880"},{"v":3795,"d":"3,795"},{"v":3810,"d":"3,810"},{"v":3790,"d":"3,790"},{"v":3785,"d":"3,785"},{"v":3870,"d":"3,870"},{"v":3990,"d":"3,990"},{"v":6145,"d":"6,145"},{"v":7190,"d":"7,190"},{"v":7140,"d":"7,140"},{"v":7290,"d":"7,290"},{"v":7480,"d":"7,480"},{"v":1261,"d":"1,261"},{"v":1155,"d":"1,155"},{"v":1031,"d":"1,031"},981,517,495,407,392,0,0,0,0,{"v":5022,"d":"5,022"},{"v":5603,"d":"5,603"},{"v":5979,"d":"5,979"},{"v":6583,"d":"6,583"},{"v":1264,"d":"1,264"},{"v":1157,"d":"1,157"},{"v":1030,"d":"1,030"},980,521,499,411,394,{"v":4440,"d":"4,440"},{"v":4391,"d":"4,391"},{"v":4353,"d":"4,353"},{"v":4286,"d":"4,286"},{"v":5079,"d":"5,079"},{"v":5676,"d":"5,676"},{"v":6054,"d":"6,054"},{"v":6675,"d":"6,675"},0,0,0,0,696,530,211,128,{"v":6375,"d":"6,375"},{"v":6733,"d":"6,733"},{"v":7080,"d":"7,080"},{"v":7181,"d":"7,181"},{"v":4440,"d":"4,440"},{"v":4391,"d":"4,391"},{"v":4353,"d":"4,353"},{"v":4286,"d":"4,286"},{"v":6225,"d":"6,225"},{"v":6047,"d":"6,047"},{"v":5794,"d":"5,794"},{"v":5660,"d":"5,660"},{"v":69380,"d":"69,380"},{"v":347087925.049,"d":"347,087,925"}]
[138,23,{"$f":"IF('iaith - language'!$K$1=2,VLOOKUP(A30,Text!$A$3:$C$353,2,FALSE),VLOOKUP(A30,Text!$A$3:$C$353,3,FALSE))","v":"Caerdydd"},698,681,622,648,{"v":127622.723477,"d":"127,623"},{"v":14230.3629999999,"d":"14,230"},{"v":367189.566059,"d":"367,190"},{"v":3961.296802,"d":"3,961"},{"v":39117.219145,"d":"39,117"},{"v":59821.731994999995,"d":"59,822"},{"v":21299.235897000002,"d":"21,299"},{"v":49922.152111,"d":"49,922"},{"v":299071.050374,"d":"299,071"},{"v":11876.418824,"d":"11,876"},{"v":75598.52376800001,"d":"75,599"},{"v":238577.36416099995,"d":"238,577"},{"v":291591.04228999995,"d":"291,591"},{"v":296004.7969899999,"d":"296,005"},{"v":71184.76906800001,"d":"71,185"},{"v":7280.676581,"d":"7,281"},{"v":249184.83213299987,"d":"249,185"},{"v":366903,"d":"366,903"},{"v":292013,"d":"292,013"},{"v":52192,"d":"52,192"},{"v":6445027.51,"d":"6,445,028"},{"v":139318,"d":"139,318"},2.4,61,{"v":12530,"d":"12,530"},{"v":4170,"d":"4,170"},{"v":42487,"d":"42,487"},{"v":2746,"d":"2,746"},{"v":30499,"d":"30,499"},{"v":31124206,"d":"31,124,206"},211,{"v":4191.808752010635,"d":"4,192"},{"v":19296.17765924512,"d":"19,296"},{"v":7845,"d":"7,845"},{"v":8030,"d":"8,030"},{"v":8155,"d":"8,155"},{"v":8065,"d":"8,065"},{"v":8260,"d":"8,260"},{"v":8225,"d":"8,225"},{"v":13470,"d":"13,470"},{"v":15660,"d":"15,660"},{"v":15440,"d":"15,440"},{"v":16005,"d":"16,005"},{"v":16460,"d":"16,460"},{"v":2848,"d":"2,848"},{"v":2651,"d":"2,651"},{"v":2405,"d":"2,405"},{"v":2256,"d":"2,256"},{"v":1208,"d":"1,208"},{"v":1069,"d":"1,069"},907,855,7,7,5,0,{"v":8981,"d":"8,981"},{"v":10423,"d":"10,423"},{"v":11651,"d":"11,651"},{"v":13004,"d":"13,004"},{"v":2849,"d":"2,849"},{"v":2657,"d":"2,657"},{"v":2410,"d":"2,410"},{"v":2264,"d":"2,264"},{"v":1219,"d":"1,219"},{"v":1075,"d":"1,075"},922,880,{"v":8766,"d":"8,766"},{"v":8635,"d":"8,635"},{"v":8559,"d":"8,559"},{"v":8456,"d":"8,456"},{"v":9087,"d":"9,087"},{"v":10531,"d":"10,531"},{"v":11780,"d":"11,780"},{"v":13162,"d":"13,162"},0,0,0,0,{"v":3009,"d":"3,009"},{"v":2340,"d":"2,340"},{"v":1427,"d":"1,427"},834,{"v":11412,"d":"11,412"},{"v":12456,"d":"12,456"},{"v":13458,"d":"13,458"},{"v":13915,"d":"13,915"},{"v":8763,"d":"8,763"},{"v":8628,"d":"8,628"},{"v":8552,"d":"8,552"},{"v":8456,"d":"8,456"},{"v":12834,"d":"12,834"},{"v":12367,"d":"12,367"},{"v":11891,"d":"11,891"},{"v":11600,"d":"11,600"},{"v":159610,"d":"159,610"},{"v":947109741.754,"d":"947,109,742"}]
[]
[139,null,{"$f":"IF('iaith - language'!$K$1=2,VLOOKUP(A32,Text!$A$3:$C$353,2,FALSE),VLOOKUP(A32,Text!$A$3:$C$353,3,FALSE))","v":"Cyfanswm AU "},{"$f":"SUM(D9:D31)","v":{"v":6085,"d":"6,085"}},{"$f":"SUM(E9:E31)","v":{"v":6067,"d":"6,067"}},{"$f":"SUM(F9:F31)","v":{"v":5604,"d":"5,604"}},{"$f":"SUM(G9:G31)","v":{"v":5877,"d":"5,877"}},{"$f":"SUM(H9:H30)","v":{"v":1207664.1616679998,"d":"1,207,664"}},{"$f":"SUM(I9:I31)","v":{"v":2078260.1899999962,"d":"2,078,260"}},{"$f":"SUM(J9:J30)","v":{"v":3163123.5256389994,"d":"3,163,124"}},{"v":33002.99726800001,"d":"33,003"},{"v":323299.373829,"d":"323,299"},{"v":506041.29667999997,"d":"506,041"},{"v":185512.69101300003,"d":"185,513"},{"v":362709.8919083688,"d":"362,710"},{"v":2594121.8486681096,"d":"2,594,122"},{"v":103024.472346,"d":"103,024"},{"v":638008.0108938892,"d":"638,008"},{"v":1852032.6495112332,"d":"1,852,033"},{"v":2525115.51479311,"d":"2,525,116"},{"v":2287461.845512122,"d":"2,287,462"},{"v":875661.6801748774,"d":"875,662"},{"v":85023.05033999999,"d":"85,023"},{"v":1957899.3656852324,"d":"1,957,899"},{"$f":"SUM(Y9:Y30)","v":{"v":3152879,"d":"3,152,879"}},{"v":2522940,"d":"2,522,940"},{"v":662376,"d":"662,376"},{"v":32320397.310000002,"d":"32,320,397"},{"v":1204399,"d":"1,204,399"},{"v":117.162,"d":"117.16"},{"v":19348,"d":"19,348"},{"$f":"SUM(AF9:AF30)","v":{"v":110540,"d":"110,540"}},{"$f":"SUM(AG9:AG30)","v":{"v":42820,"d":"42,820"}},{"$f":"SUM(AH9:AH30)","v":{"v":396333,"d":"396,333"}},{"v":33183,"d":"33,183"},{"v":275042,"d":"275,042"},{"v":271861828.53,"d":"271,861,829"},{"v":6857,"d":"6,857"},{"v":100244.19863194757,"d":"100,244"},{"v":71191.76550638313,"d":"71,192"},{"$f":"SUM(AO9:AO30)","v":{"v":57400,"d":"57,400"}},{"v":58720,"d":"58,720"},{"v":58950,"d":"58,950"},{"v":59020,"d":"59,020"},{"v":60380,"d":"60,380"},{"v":60270,"d":"60,270"},{"v":104235,"d":"104,235"},{"v":118085,"d":"118,085"},{"v":114630,"d":"114,630"},{"$f":"SUM(AX9:AX30)","v":{"v":117985,"d":"117,985"}},{"$f":"SUM(AY9:AY30)","v":{"v":120600,"d":"120,600"}},{"v":24507,"d":"24,507"},{"v":22451,"d":"22,451"},{"v":20390,"d":"20,390"},{"v":19117,"d":"19,117"},{"v":10670,"d":"10,670"},{"v":9337,"d":"9,337"},{"v":8136,"d":"8,136"},{"v":7856,"d":"7,856"},7,7,5,0,{"v":66820,"d":"66,820"},{"v":78417,"d":"78,417"},{"v":88044,"d":"88,044"},{"v":99475,"d":"99,475"},{"v":24611,"d":"24,611"},{"v":22552,"d":"22,552"},{"v":20497,"d":"20,497"},{"v":19221,"d":"19,221"},{"v":10790,"d":"10,790"},{"v":9493,"d":"9,493"},{"v":8319,"d":"8,319"},{"v":8053,"d":"8,053"},{"v":96663,"d":"96,663"},{"v":95507,"d":"95,507"},{"v":94499,"d":"94,499"},{"v":93110,"d":"93,110"},{"v":67628,"d":"67,628"},{"v":79400,"d":"79,400"},{"v":89295,"d":"89,295"},{"v":101055,"d":"101,055"},0,0,0,0,{"v":18432,"d":"18,432"},{"v":15235,"d":"15,235"},{"v":9472,"d":"9,472"},{"v":5721,"d":"5,721"},{"v":124926,"d":"124,926"},{"v":130951,"d":"130,951"},{"$f":"SUM(CP9:CP30)","v":{"v":138060,"d":"138,060"}},{"v":141283,"d":"141,283"},{"v":96646,"d":"96,646"},{"v":95497,"d":"95,497"},{"v":94482,"d":"94,482"},{"v":93112,"d":"93,112"},{"v":132064,"d":"132,064"},{"v":127552,"d":"127,552"},{"v":123315,"d":"123,315"},{"v":120384,"d":"120,384"},{"$f":"SUM(CZ9:CZ30)","v":{"v":1449410,"d":"1,449,410"}},{"$f":"SUM(DA9:DA30)","v":{"v":8172629337.878,"d":"8,172,629,338"}}]
[]
[]
[null,27,null,{"$f":"IF('iaith - language'!K1=2,VLOOKUP(B35,Text!$A$3:$C$353,2),VLOOKUP(B35,Text!$A$3:$C$353,3))","v":"Yr Is-adran Polisi Cyllid Llywodraeth Leol a Chynaliadwyedd, Llywodraeth Cymru"}]
[null,30,null,{"$f":"IF('iaith - language'!K1=2,VLOOKUP(B36,Text!$A$3:$C$353,2),VLOOKUP(B36,Text!$A$3:$C$353,3))","v":"Os oes gennych ymholiadau, cysylltwch â:"}]
[null,29,null,"LGFPSettlement@Gov.Wales"]
[]
[null,33,null,{"$f":"IF('iaith - language'!K1=2,VLOOKUP(B39,Text!$A$3:$C$353,2),VLOOKUP(B39,Text!$A$3:$C$353,3))","v":"Nodiadau:"}]
[null,34,null,{"$f":"IF('iaith - language'!K1=2,VLOOKUP(B40,Text!$A$3:$C$353,2),VLOOKUP(B40,Text!$A$3:$C$353,3))","v":"1 Caiff y set ddata hon ei chymryd fel cyfartaledd 3 blynedd yn y setliad."}]
[null,273]

{"sheet":"2020-21 Settlement data","index":6,"n_rows":45,"n_cols":94,"rows_kept":45,"hidden":true,"merged":[[5,3,5,6],[5,25,5,35],[5,36,5,39],[5,40,5,43],[5,44,5,47],[5,48,5,51],[5,52,5,55],[5,56,5,59],[5,60,5,63],[5,64,5,67],[5,68,5,71],[5,72,5,75],[5,76,5,79],[5,80,5,83],[5,84,5,87],[5,88,5,91]]}
[500,null,{"$f":"IF('iaith - language'!$K$1=2,VLOOKUP(A1,Text!A3:C470,2,FALSE),VLOOKUP(A1,Text!A3:C469,3,FALSE))","v":"Data a ddefnyddiwyd yn Setliad 2020-21 – er gwybodaeth yn unig"}]
[]
[{"$nulls":3},51,{"$nulls":3},61,62,82,83,84,86,90,91,92,145,147,143,149,151,152,160,162,163,192,{"$nulls":10},194,{"$nulls":3},195,{"$nulls":3},196,{"$nulls":3},197,{"$nulls":3},198,{"$nulls":3},199,{"$nulls":3},200,{"$nulls":3},201,{"$nulls":3},202,{"$nulls":3},203,{"$nulls":3},204,{"$nulls":3},205,{"$nulls":3},206,{"$nulls":3},207,{"$nulls":3},271.5,59]
[{"$nulls":3},501,{"$f":"D4+1","v":502},{"$f":"E4+1","v":503},{"$f":"F4+1","v":504},238,504,{"$nulls":5},505,null,{"$f":"I4","v":504},{"$f":"Q4","v":504},506,{"$nulls":6},507,{"$f":"Z4+1","v":508},{"$f":"AA4+1","v":509},510,511,{"$f":"Z4-3","v":504},{"$f":"Z4-1","v":506},{"$f":"AF4-1","v":505},{"$f":"AD4+1","v":512},513,514,515,516,{"$f":"AA4","v":508},{"$f":"AD4","v":511},{"$f":"AK4","v":515},{"$f":"AL4","v":516},508,511,515,516,508,511,515,516,508,511,515,516,508,511,515,516,508,511,515,516,508,511,515,516,508,511,515,516,508,511,515,516,508,511,515,516,508,511,515,516,508,511,515,516,508,511,515,516,508,511,504]
[]
[{"$nulls":3},{"$f":"IF('iaith - language'!$K$1=2,VLOOKUP(D3,Text!$A$3:$C$386,2,FALSE),VLOOKUP(D3,Text!$A$3:$C$386,3, FALSE))","v":"Ceisiadau Cynllunio a Gafwyd"},{"$nulls":3},{"$f":"IF('iaith - language'!$K$1=2,VLOOKUP(H3,Text!$A$3:$C$386,2,FALSE),VLOOKUP(H3,Text!$A$3:$C$386,3, FALSE))","v":"Stoc anheddau'r sector preifat"},{"$f":"IF('iaith - language'!$K$1=2,VLOOKUP(I3,Text!$A$3:$C$386,2,FALSE),VLOOKUP(I3,Text!$A$3:$C$386,3, FALSE))","v":"Arwynebedd tir (hectarau)"},{"$f":"IF('iaith - language'!$K$1=2,VLOOKUP(J3,Text!$A$3:$C$386,2,FALSE),VLOOKUP(J3,Text!$A$3:$C$386,3, FALSE))","v":"Amcangyfrifon Poblogaeth Ganol Blwyddyn, pob oed"},{"$f":"IF('iaith - language'!$K$1=2,VLOOKUP(K3,Text!$A$3:$C$386,2,FALSE),VLOOKUP(K3,Text!$A$3:$C$386,3, FALSE))","v":"Amcangyfrifon Poblogaeth Ganol Blwyddyn, 18 oed a throsodd"},{"$f":"IF('iaith - language'!$K$1=2,VLOOKUP(L3,Text!$A$3:$C$386,2,FALSE),VLOOKUP(L3,Text!$A$3:$C$386,3, FALSE))","v":"Amcangyfrifon Poblogaeth Ganol Blwyddyn, 65 oed a throsodd"},{"$f":"IF('iaith - language'!$K$1=2,VLOOKUP(M3,Text!$A$3:$C$386,2,FALSE),VLOOKUP(M3,Text!$A$3:$C$386,3, FALSE))","v":"Swm a wariwyd ar grantiau cyfleusterau i'r anabl wedi'u cwblhau (£s)"},{"$f":"IF('iaith - language'!$K$1=2,VLOOKUP(N3,Text!$A$3:$C$386,2,FALSE),VLOOKUP(N3,Text!$A$3:$C$386,3, FALSE))","v":"Praeseptau Draenio Tir"},{"$f":"IF('iaith - language'!$K$1=2,VLOOKUP(O3,Text!$A$3:$C$386,2,FALSE),VLOOKUP(O3,Text!$A$3:$C$386,3, FALSE))","v":"Hyd yr arfordir a warchodir"},{"$f":"IF('iaith - language'!$K$1=2,VLOOKUP(P3,Text!$A$3:$C$386,2,FALSE),VLOOKUP(P3,Text!$A$3:$C$386,3, FALSE))","v":"Nifer y Ffermydd"},{"$f":"IF('iaith - language'!$K$1=2,VLOOKUP(Q3,Text!$A$3:$C$386,2,FALSE),VLOOKUP(Q3,Text!$A$3:$C$386,3, FALSE))","v":"Nifer yr Eiddo Masnachu"},{"$f":"IF('iaith - language'!$K$1=2,VLOOKUP(R3,Text!$A$3:$C$386,2,FALSE),VLOOKUP(R3,Text!$A$3:$C$386,3, FALSE))","v":"Nifer yr Eiddo Bwyd"},{"$f":"IF('iaith - language'!$K$1=2,VLOOKUP(S3,Text!$A$3:$C$386,2,FALSE),VLOOKUP(S3,Text!$A$3:$C$386,3, FALSE))","v":"Cyfanswm yr unedau goleuadau stryd"},{"$f":"IF('iaith - language'!$K$1=2,VLOOKUP(T3,Text!$A$3:$C$386,2,FALSE),VLOOKUP(T3,Text!$A$3:$C$386,3, FALSE))","v":"Nifer y marwolaethau wedi'u cofrestru"},{"$f":"IF('iaith - language'!$K$1=2,VLOOKUP(U3,Text!$A$3:$C$386,2,FALSE),VLOOKUP(U3,Text!$A$3:$C$386,3, FALSE))","v":"Llwyth achosion Cynlluniau Gostyngiadau'r Dreth Gyngor "},{"$f":"IF('iaith - language'!$K$1=2,VLOOKUP(V3,Text!$A$3:$C$386,2,FALSE),VLOOKUP(V3,Text!$A$3:$C$386,3, FALSE))","v":"Gwariant Cynlluniau Gostyngiadau'r Dreth Gyngor"},{"$f":"IF('iaith - language'!$K$1=2,VLOOKUP(W3,Text!$A$3:$C$386,2,FALSE),VLOOKUP(W3,Text!$A$3:$C$386,3, FALSE))","v":"Nifer y llongau sy'n cyrraedd porthladdoedd"},{"$f":"IF('iaith - language'!$K$1=2,VLOOKUP(X3,Text!$A$3:$C$386,2,FALSE),VLOOKUP(X3,Text!$A$3:$C$386,3, FALSE))","v":"Nosweithiau twristiaid (miloedd) gan gynnwys AirBnb"},{"$f":"IF('iaith - language'!$K$1=2,VLOOKUP(Y3,Text!$A$3:$C$386,2,FALSE),VLOOKUP(Y3,Text!$A$3:$C$386,3, FALSE))","v":"Diwrnodau twristiaid (miloedd)"},{"$f":"IF('iaith - language'!$K$1=2,VLOOKUP(Z3,Text!$A$3:$C$386,2,FALSE),VLOOKUP(Z3,Text!$A$3:$C$386,3, FALSE))","v":"Data Hawlwyr Budd-dal "},{"$nulls":10},{"$f":"IF('iaith - language'!$K$1=2,VLOOKUP(AK3,Text!$A$3:$C$386,2,FALSE),VLOOKUP(AK3,Text!$A$3:$C$386,3, FALSE))","v":"Nifer yr Hawlwyr Cymhorthdal Incwm, 18-64 oed"},{"$nulls":3},{"$f":"IF('iaith - language'!$K$1=2,VLOOKUP(AO3,Text!$A$3:$C$386,2,FALSE),VLOOKUP(AO3,Text!$A$3:$C$386,3, FALSE))","v":"Nifer y Derbynwyr Lwfans Ceisio Swydd ar Sail Incwm, 18-64 oed"},{"$nulls":3},{"$f":"IF('iaith - language'!$K$1=2,VLOOKUP(AS3,Text!$A$3:$C$386,2,FALSE),VLOOKUP(AS3,Text!$A$3:$C$386,3, FALSE))","v":"Nifer yr hawlwyr Credyd Pensiwn, 18-64 oed"},{"$nulls":3},{"$f":"IF('iaith - language'!$K$1=2,VLOOKUP(AW3,Text!$A$3:$C$386,2,FALSE),VLOOKUP(AW3,Text!$A$3:$C$386,3, FALSE))","v":"Nifer y rhai sydd yn derbyn Credyd Cynhwysol (ddim mewn cyflogaeth) 18-64 oed"},{"$nulls":3},{"$f":"IF('iaith - language'!$K$1=2,VLOOKUP(BA3,Text!$A$3:$C$386,2,FALSE),VLOOKUP(BA3,Text!$A$3:$C$386,3, FALSE))","v":"Cyfanswm yr Hawlwyr Cymhorthdal Incwm"},{"$nulls":3},{"$f":"IF('iaith - language'!$K$1=2,VLOOKUP(BE3,Text!$A$3:$C$386,2,FALSE),VLOOKUP(BE3,Text!$A$3:$C$386,3, FALSE))","v":"Cyfanswm y Derbynwyr Lwfans Ceisio Swydd ar Sail Incwm"},{"$nulls":3},{"$f":"IF('iaith - language'!$K$1=2,VLOOKUP(BI3,Text!$A$3:$C$386,2,FALSE),VLOOKUP(BI3,Text!$A$3:$C$386,3, FALSE))","v":"Cyfanswm Hawlwyr Credyd Pensiwn"},{"$nulls":3},{"$f":"IF('iaith - language'!$K$1=2,VLOOKUP(BM3,Text!$A$3:$C$386,2,FALSE),VLOOKUP(BM3,Text!$A$3:$C$386,3, FALSE))","v":"Cyfanswm y rhai sy’n derbyn Credyd Cynhwysol (ddim mewn cyflogaeth)"},{"$nulls":3},{"$f":"IF('iaith - language'!$K$1=2,VLOOKUP(BQ3,Text!$A$3:$C$386,2,FALSE),VLOOKUP(BQ3,Text!$A$3:$C$386,3, FALSE))","v":"Nifer yr Hawlwyr Lwfans Anabledd Difrifol, 18-64 oed"},{"$nulls":3},{"$f":"IF('iaith - language'!$K$1=2,VLOOKUP(BU3,Text!$A$3:$C$386,2,FALSE),VLOOKUP(BU3,Text!$A$3:$C$386,3, FALSE))","v":"Nifer yr Hawlwyr Lwfans Byw i'r Anabl, 18-64 oed"},{"$nulls":3},{"$f":"IF('iaith - language'!$K$1=2,VLOOKUP(BY3,Text!$A$3:$C$386,2,FALSE),VLOOKUP(BY3,Text!$A$3:$C$386,3, FALSE))","v":"Nifer yr Hawlwyr Taliad Annibyniaeth Bersonol sydd yn 18-64 oed"},{"$nulls":3},{"$f":"IF('iaith - language'!$K$1=2,VLOOKUP(CC3,Text!$A$3:$C$386,2,FALSE),VLOOKUP(CC3,Text!$A$3:$C$386,3, FALSE))","v":"Hawlwyr Credyd Pensiwn, 65 oed a hŷn "},{"$nulls":3},{"$f":"IF('iaith - language'!$K$1=2,VLOOKUP(CG3,Text!$A$3:$C$386,2,FALSE),VLOOKUP(CG3,Text!$A$3:$C$386,3, FALSE))","v":"Cyfanswn yr hawlwyr Cymhorthdal Incwm, Lwfans Ceisio Gwaith, a Chredyd Pensiwn"},{"$nulls":3},{"$f":"IF('iaith - language'!$K$1=2,VLOOKUP(CK3,Text!$A$3:$C$386,2,FALSE),VLOOKUP(CK3,Text!$A$3:$C$386,3, FALSE))","v":"Pobl (18-64) sy'n hawlio Lwfans Anabledd Difrifol a Lwfans Byw i'r Anabl"},{"$nulls":3},{"$f":"IF('iaith - language'!$K$1=2,VLOOKUP(CO3,Text!$A$3:$C$386,2,FALSE),VLOOKUP(CO3,Text!$A$3:$C$386,3, FALSE))","v":"Stoc eiddo treth cyngor"},{"$f":"IF('iaith - language'!$K$1=2,VLOOKUP(CP3,Text!$A$3:$C$386,2,FALSE),VLOOKUP(CP3,Text!$A$3:$C$386,3, FALSE))","v":"Llif traffig (cerbydau)"}]
[{"$nulls":3},{"$f":"IF('iaith - language'!$K$1=2,VLOOKUP(D4,Text!$A$3:$C$267,2,FALSE),VLOOKUP(D4,Text!$A$3:$C$267,3,FALSE))","v":"Mehefin 2018"},{"$f":"IF('iaith - language'!$K$1=2,VLOOKUP(E4,Text!$A$3:$C$267,2,FALSE),VLOOKUP(E4,Text!$A$3:$C$267,3,FALSE))","v":"Medi 2018"},{"$f":"IF('iaith - language'!$K$1=2,VLOOKUP(F4,Text!$A$3:$C$267,2,FALSE),VLOOKUP(F4,Text!$A$3:$C$267,3,FALSE))","v":"Rhagfyr 2018"},{"$f":"IF('iaith - language'!$K$1=2,VLOOKUP(G4,Text!$A$3:$C$267,2,FALSE),VLOOKUP(G4,Text!$A$3:$C$267,3,FALSE))","v":"Mawrth 2019"},"2018-19",{"$f":"IF('iaith - language'!$K$1=2,VLOOKUP(I4,Text!$A$3:$C$267,2,FALSE),VLOOKUP(I4,Text!$A$3:$C$267,3,FALSE))","v":"Mawrth 2019"},"2018","2018","2018","2017-2018","2019-2020",{"$f":"IF('iaith - language'!$K$1=2,VLOOKUP(O4,Text!$A$3:$C$267,2,FALSE),VLOOKUP(O4,Text!$A$3:$C$267,3,FALSE))","v":"Mai 2019"},"2018",{"$f":"IF('iaith - language'!$K$1=2,VLOOKUP(Q4,Text!$A$3:$C$267,2,FALSE),VLOOKUP(Q4,Text!$A$3:$C$267,3,FALSE))","v":"Mawrth 2019"},{"$f":"IF('iaith - language'!$K$1=2,VLOOKUP(R4,Text!$A$3:$C$267,2,FALSE),VLOOKUP(R4,Text!$A$3:$C$267,3,FALSE))","v":"Mawrth 2019"},{"$f":"IF('iaith - language'!$K$1=2,VLOOKUP(S4,Text!$A$3:$C$267,2,FALSE),VLOOKUP(S4,Text!$A$3:$C$267,3,FALSE))","v":"Ebrill 2019"},"2018","2018-2019","2018-2019","2018","2018","2018",{"$f":"IF('iaith - language'!$K$1=2,VLOOKUP(Z4,Text!$A$3:$C$267,2,FALSE),VLOOKUP(Z4,Text!$A$3:$C$267,3,FALSE))","v":"Hydref 2018"},{"$f":"IF('iaith - language'!$K$1=2,VLOOKUP(AA4,Text!$A$3:$C$267,2,FALSE),VLOOKUP(AA4,Text!$A$3:$C$267,3,FALSE))","v":"Tachwedd 2018"},{"$f":"IF('iaith - language'!$K$1=2,VLOOKUP(AB4,Text!$A$3:$C$267,2,FALSE),VLOOKUP(AB4,Text!$A$3:$C$267,3,FALSE))","v":"Rhagfyr 2018"},{"$f":"IF('iaith - language'!$K$1=2,VLOOKUP(AC4,Text!$A$3:$C$267,2,FALSE),VLOOKUP(AC4,Text!$A$3:$C$267,3,FALSE))","v":"Ionawr 2019"},{"$f":"IF('iaith - language'!$K$1=2,VLOOKUP(AD4,Text!$A$3:$C$267,2,FALSE),VLOOKUP(AD4,Text!$A$3:$C$267,3,FALSE))","v":"Chwefror 2019"},{"$f":"IF('iaith - language'!$K$1=2,VLOOKUP(AE4,Text!$A$3:$C$267,2,FALSE),VLOOKUP(AE4,Text!$A$3:$C$267,3,FALSE))","v":"Mawrth 2019"},{"$f":"IF('iaith - language'!$K$1=2,VLOOKUP(AF4,Text!$A$3:$C$267,2,FALSE),VLOOKUP(AF4,Text!$A$3:$C$267,3,FALSE))","v":"Ebrill 2019"},{"$f":"IF('iaith - language'!$K$1=2,VLOOKUP(AG4,Text!$A$3:$C$267,2,FALSE),VLOOKUP(AG4,Text!$A$3:$C$267,3,FALSE))","v":"Mai 2019"},{"$f":"IF('iaith - language'!$K$1=2,VLOOKUP(AH4,Text!$A$3:$C$267,2,FALSE),VLOOKUP(AH4,Text!$A$3:$C$267,3,FALSE))","v":"Mehefin 2019"},{"$f":"IF('iaith - language'!$K$1=2,VLOOKUP(AI4,Text!$A$3:$C$267,2,FALSE),VLOOKUP(AI4,Text!$A$3:$C$267,3,FALSE))","v":"Gorffennaf 2019"},{"$f":"IF('iaith - language'!$K$1=2,VLOOKUP(AJ4,Text!$A$3:$C$267,2,FALSE),VLOOKUP(AJ4,Text!$A$3:$C$267,3,FALSE))","v":"Awst 2019"},{"$f":"IF('iaith - language'!$K$1=2,VLOOKUP(AK4,Text!$A$3:$C$267,2,FALSE),VLOOKUP(AK4,Text!$A$3:$C$267,3,FALSE))","v":"Mai 2018"},{"$f":"IF('iaith - language'!$K$1=2,VLOOKUP(AL4,Text!$A$3:$C$267,2,FALSE),VLOOKUP(AL4,Text!$A$3:$C$267,3,FALSE))","v":"Awst 2018"},{"$f":"IF('iaith - language'!$K$1=2,VLOOKUP(AM4,Text!$A$3:$C$267,2,FALSE),VLOOKUP(AM4,Text!$A$3:$C$267,3,FALSE))","v":"Tachwedd 2018"},{"$f":"IF('iaith - language'!$K$1=2,VLOOKUP(AN4,Text!$A$3:$C$267,2,FALSE),VLOOKUP(AN4,Text!$A$3:$C$267,3,FALSE))","v":"Chwefror 2019"},{"$f":"IF('iaith - language'!$K$1=2,VLOOKUP(AO4,Text!$A$3:$C$267,2,FALSE),VLOOKUP(AO4,Text!$A$3:$C$267,3,FALSE))","v":"Mai 2018"},{"$f":"IF('iaith - language'!$K$1=2,VLOOKUP(AP4,Text!$A$3:$C$267,2,FALSE),VLOOKUP(AP4,Text!$A$3:$C$267,3,FALSE))","v":"Awst 2018"},{"$f":"IF('iaith - language'!$K$1=2,VLOOKUP(AQ4,Text!$A$3:$C$267,2,FALSE),VLOOKUP(AQ4,Text!$A$3:$C$267,3,FALSE))","v":"Tachwedd 2018"},{"$f":"IF('iaith - language'!$K$1=2,VLOOKUP(AR4,Text!$A$3:$C$267,2,FALSE),VLOOKUP(AR4,Text!$A$3:$C$267,3,FALSE))","v":"Chwefror 2019"},{"$f":"IF('iaith - language'!$K$1=2,VLOOKUP(AS4,Text!$A$3:$C$267,2,FALSE),VLOOKUP(AS4,Text!$A$3:$C$267,3,FALSE))","v":"Mai 2018"},{"$f":"IF('iaith - language'!$K$1=2,VLOOKUP(AT4,Text!$A$3:$C$267,2,FALSE),VLOOKUP(AT4,Text!$A$3:$C$267,3,FALSE))","v":"Awst 2018"},{"$f":"IF('iaith - language'!$K$1=2,VLOOKUP(AU4,Text!$A$3:$C$267,2,FALSE),VLOOKUP(AU4,Text!$A$3:$C$267,3,FALSE))","v":"Tachwedd 2018"},{"$f":"IF('iaith - language'!$K$1=2,VLOOKUP(AV4,Text!$A$3:$C$267,2,FALSE),VLOOKUP(AV4,Text!$A$3:$C$267,3,FALSE))","v":"Chwefror 2019"},{"$f":"IF('iaith - language'!$K$1=2,VLOOKUP(AW4,Text!$A$3:$C$267,2,FALSE),VLOOKUP(AW4,Text!$A$3:$C$267,3,FALSE))","v":"Mai 2018"},{"$f":"IF('iaith - language'!$K$1=2,VLOOKUP(AX4,Text!$A$3:$C$267,2,FALSE),VLOOKUP(AX4,Text!$A$3:$C$267,3,FALSE))","v":"Awst 2018"},{"$f":"IF('iaith - language'!$K$1=2,VLOOKUP(AY4,Text!$A$3:$C$267,2,FALSE),VLOOKUP(AY4,Text!$A$3:$C$267,3,FALSE))","v":"Tachwedd 2018"},{"$f":"IF('iaith - language'!$K$1=2,VLOOKUP(AZ4,Text!$A$3:$C$267,2,FALSE),VLOOKUP(AZ4,Text!$A$3:$C$267,3,FALSE))","v":"Chwefror 2019"},{"$f":"IF('iaith - language'!$K$1=2,VLOOKUP(BA4,Text!$A$3:$C$267,2,FALSE),VLOOKUP(BA4,Text!$A$3:$C$267,3,FALSE))","v":"Mai 2018"},{"$f":"IF('iaith - language'!$K$1=2,VLOOKUP(BB4,Text!$A$3:$C$267,2,FALSE),VLOOKUP(BB4,Text!$A$3:$C$267,3,FALSE))","v":"Awst 2018"},{"$f":"IF('iaith - language'!$K$1=2,VLOOKUP(BC4,Text!$A$3:$C$267,2,FALSE),VLOOKUP(BC4,Text!$A$3:$C$267,3,FALSE))","v":"Tachwedd 2018"},{"$f":"IF('iaith - language'!$K$1=2,VLOOKUP(BD4,Text!$A$3:$C$267,2,FALSE),VLOOKUP(BD4,Text!$A$3:$C$267,3,FALSE))","v":"Chwefror 2019"},{"$f":"IF('iaith - language'!$K$1=2,VLOOKUP(BE4,Text!$A$3:$C$267,2,FALSE),VLOOKUP(BE4,Text!$A$3:$C$267,3,FALSE))","v":"Mai 2018"},{"$f":"IF('iaith - language'!$K$1=2,VLOOKUP(BF4,Text!$A$3:$C$267,2,FALSE),VLOOKUP(BF4,Text!$A$3:$C$267,3,FALSE))","v":"Awst 2018"},{"$f":"IF('iaith - language'!$K$1=2,VLOOKUP(BG4,Text!$A$3:$C$267,2,FALSE),VLOOKUP(BG4,Text!$A$3:$C$267,3,FALSE))","v":"Tachwedd 2018"},{"$f":"IF('iaith - language'!$K$1=2,VLOOKUP(BH4,Text!$A$3:$C$267,2,FALSE),VLOOKUP(BH4,Text!$A$3:$C$267,3,FALSE))","v":"Chwefror 2019"},{"$f":"IF('iaith - language'!$K$1=2,VLOOKUP(BI4,Text!$A$3:$C$267,2,FALSE),VLOOKUP(BI4,Text!$A$3:$C$267,3,FALSE))","v":"Mai 2018"},{"$f":"IF('iaith - language'!$K$1=2,VLOOKUP(BJ4,Text!$A$3:$C$267,2,FALSE),VLOOKUP(BJ4,Text!$A$3:$C$267,3,FALSE))","v":"Awst 2018"},{"$f":"IF('iaith - language'!$K$1=2,VLOOKUP(BK4,Text!$A$3:$C$267,2,FALSE),VLOOKUP(BK4,Text!$A$3:$C$267,3,FALSE))","v":"Tachwedd 2018"},{"$f":"IF('iaith - language'!$K$1=2,VLOOKUP(BL4,Text!$A$3:$C$267,2,FALSE),VLOOKUP(BL4,Text!$A$3:$C$267,3,FALSE))","v":"Chwefror 2019"},{"$f":"IF('iaith - language'!$K$1=2,VLOOKUP(BM4,Text!$A$3:$C$267,2,FALSE),VLOOKUP(BM4,Text!$A$3:$C$267,3,FALSE))","v":"Mai 2018"},{"$f":"IF('iaith - language'!$K$1=2,VLOOKUP(BN4,Text!$A$3:$C$267,2,FALSE),VLOOKUP(BN4,Text!$A$3:$C$267,3,FALSE))","v":"Awst 2018"},{"$f":"IF('iaith - language'!$K$1=2,VLOOKUP(BO4,Text!$A$3:$C$267,2,FALSE),VLOOKUP(BO4,Text!$A$3:$C$267,3,FALSE))","v":"Tachwedd 2018"},{"$f":"IF('iaith - language'!$K$1=2,VLOOKUP(BP4,Text!$A$3:$C$267,2,FALSE),VLOOKUP(BP4,Text!$A$3:$C$267,3,FALSE))","v":"Chwefror 2019"},{"$f":"IF('iaith - language'!$K$1=2,VLOOKUP(BQ4,Text!$A$3:$C$267,2,FALSE),VLOOKUP(BQ4,Text!$A$3:$C$267,3,FALSE))","v":"Mai 2018"},{"$f":"IF('iaith - language'!$K$1=2,VLOOKUP(BR4,Text!$A$3:$C$267,2,FALSE),VLOOKUP(BR4,Text!$A$3:$C$267,3,FALSE))","v":"Awst 2018"},{"$f":"IF('iaith - language'!$K$1=2,VLOOKUP(BS4,Text!$A$3:$C$267,2,FALSE),VLOOKUP(BS4,Text!$A$3:$C$267,3,FALSE))","v":"Tachwedd 2018"},{"$f":"IF('iaith - language'!$K$1=2,VLOOKUP(BT4,Text!$A$3:$C$267,2,FALSE),VLOOKUP(BT4,Text!$A$3:$C$267,3,FALSE))","v":"Chwefror 2019"},{"$f":"IF('iaith - language'!$K$1=2,VLOOKUP(BU4,Text!$A$3:$C$267,2,FALSE),VLOOKUP(BU4,Text!$A$3:$C$267,3,FALSE))","v":"Mai 2018"},{"$f":"IF('iaith - language'!$K$1=2,VLOOKUP(BV4,Text!$A$3:$C$267,2,FALSE),VLOOKUP(BV4,Text!$A$3:$C$267,3,FALSE))","v":"Awst 2018"},{"$f":"IF('iaith - language'!$K$1=2,VLOOKUP(BW4,Text!$A$3:$C$267,2,FALSE),VLOOKUP(BW4,Text!$A$3:$C$267,3,FALSE))","v":"Tachwedd 2018"},{"$f":"IF('iaith - language'!$K$1=2,VLOOKUP(BX4,Text!$A$3:$C$267,2,FALSE),VLOOKUP(BX4,Text!$A$3:$C$267,3,FALSE))","v":"Chwefror 2019"},{"$f":"IF('iaith - language'!$K$1=2,VLOOKUP(BY4,Text!$A$3:$C$267,2,FALSE),VLOOKUP(BY4,Text!$A$3:$C$267,3,FALSE))","v":"Mai 2018"},{"$f":"IF('iaith - language'!$K$1=2,VLOOKUP(BZ4,Text!$A$3:$C$267,2,FALSE),VLOOKUP(BZ4,Text!$A$3:$C$267,3,FALSE))","v":"Awst 2018"},{"$f":"IF('iaith - language'!$K$1=2,VLOOKUP(CA4,Text!$A$3:$C$267,2,FALSE),VLOOKUP(CA4,Text!$A$3:$C$267,3,FALSE))","v":"Tachwedd 2018"},{"$f":"IF('iaith - language'!$K$1=2,VLOOKUP(CB4,Text!$A$3:$C$267,2,FALSE),VLOOKUP(CB4,Text!$A$3:$C$267,3,FALSE))","v":"Chwefror 2019"},{"$f":"IF('iaith - language'!$K$1=2,VLOOKUP(CC4,Text!$A$3:$C$267,2,FALSE),VLOOKUP(CC4,Text!$A$3:$C$267,3,FALSE))","v":"Mai 2018"},{"$f":"IF('iaith - language'!$K$1=2,VLOOKUP(CD4,Text!$A$3:$C$267,2,FALSE),VLOOKUP(CD4,Text!$A$3:$C$267,3,FALSE))","v":"Awst 2018"},{"$f":"IF('iaith - language'!$K$1=2,VLOOKUP(CE4,Text!$A$3:$C$267,2,FALSE),VLOOKUP(CE4,Text!$A$3:$C$267,3,FALSE))","v":"Tachwedd 2018"},{"$f":"IF('iaith - language'!$K$1=2,VLOOKUP(CF4,Text!$A$3:$C$267,2,FALSE),VLOOKUP(CF4,Text!$A$3:$C$267,3,FALSE))","v":"Chwefror 2019"},{"$f":"IF('iaith - language'!$K$1=2,VLOOKUP(CG4,Text!$A$3:$C$267,2,FALSE),VLOOKUP(CG4,Text!$A$3:$C$267,3,FALSE))","v":"Mai 2018"},{"$f":"IF('iaith - language'!$K$1=2,VLOOKUP(CH4,Text!$A$3:$C$267,2,FALSE),VLOOKUP(CH4,Text!$A$3:$C$267,3,FALSE))","v":"Awst 2018"},{"$f":"IF('iaith - language'!$K$1=2,VLOOKUP(CI4,Text!$A$3:$C$267,2,FALSE),VLOOKUP(CI4,Text!$A$3:$C$267,3,FALSE))","v":"Tachwedd 2018"},{"$f":"IF('iaith - language'!$K$1=2,VLOOKUP(CJ4,Text!$A$3:$C$267,2,FALSE),VLOOKUP(CJ4,Text!$A$3:$C$267,3,FALSE))","v":"Chwefror 2019"},{"$f":"IF('iaith - language'!$K$1=2,VLOOKUP(CK4,Text!$A$3:$C$267,2,FALSE),VLOOKUP(CK4,Text!$A$3:$C$267,3,FALSE))","v":"Mai 2018"},{"$f":"IF('iaith - language'!$K$1=2,VLOOKUP(CL4,Text!$A$3:$C$267,2,FALSE),VLOOKUP(CL4,Text!$A$3:$C$267,3,FALSE))","v":"Awst 2018"},{"$f":"IF('iaith - language'!$K$1=2,VLOOKUP(CM4,Text!$A$3:$C$267,2,FALSE),VLOOKUP(CM4,Text!$A$3:$C$267,3,FALSE))","v":"Tachwedd 2018"},{"$f":"IF('iaith - language'!$K$1=2,VLOOKUP(CN4,Text!$A$3:$C$267,2,FALSE),VLOOKUP(CN4,Text!$A$3:$C$267,3,FALSE))","v":"Chwefror 2019"},{"$f":"IF('iaith - language'!$K$1=2,VLOOKUP(CO4,Text!$A$3:$C$267,2,FALSE),VLOOKUP(CO4,Text!$A$3:$C$267,3,FALSE))","v":"Mawrth 2019"},"2018"]
[]
[117,2,{"$f":"IF('iaith - language'!$K$1=2,VLOOKUP(A9,Text!$A$3:$C$353,2,FALSE),VLOOKUP(A9,Text!$A$3:$C$353,3,FALSE))","v":"Sir Ynys Môn"},235,212,219,247,{"v":30090.666667,"d":"30,091"},{"v":71480.179,"d":"71,480.18"},{"v":69961,"d":"69,961"},{"v":56521,"d":"56,521"},{"v":17992,"d":"17,992"},{"v":701490.66,"d":"701,491"},{"v":3375,"d":"3,375"},{"v":7.9,"d":"7.90"},904,{"v":2860,"d":"2,860"},{"v":1020,"d":"1,020"},{"v":9925,"d":"9,925"},862,{"v":5848,"d":"5,848"},{"v":5381002,"d":"5,381,002"},{"v":3069,"d":"3,069"},{"v":5086.30539605628,"d":"5,086"},{"v":701.0404866623041,"d":"701"},835,825,810,880,970,{"v":1045,"d":"1,045"},{"v":1080,"d":"1,080"},{"v":1050,"d":"1,050"},{"v":1085,"d":"1,085"},{"v":1085,"d":"1,085"},{"v":1085,"d":"1,085"},652,668,647,598,500,400,400,500,24,9,0,0,268,228,216,485,660,679,654,601,500,400,400,500,{"v":2675,"d":"2,675"},{"v":2631,"d":"2,631"},{"v":2599,"d":"2,599"},{"v":2554,"d":"2,554"},270,228,216,490,0,0,0,0,138,135,125,125,2492,2498,2543,2538,{"v":2649,"d":"2,649"},{"v":2619,"d":"2,619"},{"v":2599,"d":"2,599"},{"v":2554,"d":"2,554"},3835,3710,3653,3655,138,135,125,125,{"v":35200,"d":"35,200"},{"v":216630756.622,"d":"216,630,757"}]
[118,3,{"$f":"IF('iaith - language'!$K$1=2,VLOOKUP(A10,Text!$A$3:$C$353,2,FALSE),VLOOKUP(A10,Text!$A$3:$C$353,3,FALSE))","v":"Gwynedd"},257,256,268,288,{"v":53709.666667,"d":"53,710"},{"v":254789.170999999,"d":"254,789.17"},{"v":124178,"d":"124,178"},{"v":100757,"d":"100,757"},{"v":28171,"d":"28,171"},{"v":548905.43,"d":"548,905"},{"v":109336,"d":"109,336"},{"v":20.137,"d":"20.14"},{"v":1742,"d":"1,742"},{"v":7380,"d":"7,380"},{"v":2530,"d":"2,530"},{"v":17611,"d":"17,611"},{"v":1415,"d":"1,415"},{"v":9367,"d":"9,367"},{"v":9324573,"d":"9,324,573"},4,{"v":18725.1604390483,"d":"18,725"},{"v":3802.1458702164173,"d":"3,802"},{"v":1130,"d":"1,130"},{"v":1150,"d":"1,150"},{"v":1235,"d":"1,235"},{"v":1380,"d":"1,380"},{"v":1440,"d":"1,440"},{"v":1435,"d":"1,435"},{"v":1425,"d":"1,425"},{"v":1395,"d":"1,395"},{"v":1470,"d":"1,470"},{"v":1500,"d":"1,500"},{"v":1555,"d":"1,555"},901,901,911,829,500,500,500,700,40,10,0,0,386,329,325,811,914,908,920,841,500,500,500,700,{"v":4380,"d":"4,380"},{"v":4329,"d":"4,329"},{"v":4250,"d":"4,250"},{"v":4163,"d":"4,163"},386,329,328,820,0,0,0,0,227,214,213,213,3383,3412,3473,3445,{"v":4344,"d":"4,344"},{"v":4315,"d":"4,315"},{"v":4250,"d":"4,250"},{"v":4163,"d":"4,163"},5794,5737,5670,5704,227,214,213,213,{"v":61610,"d":"61,610"},{"v":450314274.71500003,"d":"450,314,275"}]
[119,4,{"$f":"IF('iaith - language'!$K$1=2,VLOOKUP(A11,Text!$A$3:$C$353,2,FALSE),VLOOKUP(A11,Text!$A$3:$C$353,3,FALSE))","v":"Conwy"},258,250,195,213,{"v":51433.333333,"d":"51,433"},{"v":113019.73300000001,"d":"113,019.73"},{"v":117181,"d":"117,181"},{"v":95778,"d":"95,778"},{"v":32154,"d":"32,154"},{"v":1186631.23,"d":"1,186,631"},{"v":33810,"d":"33,810"},23.59,889,{"v":5040,"d":"5,040"},{"v":2200,"d":"2,200"},{"v":16594,"d":"16,594"},{"v":1646,"d":"1,646"},{"v":10252,"d":"10,252"},{"v":9576115,"d":"9,576,115"},67,{"v":10573.106889537492,"d":"10,573"},{"v":6913.851739961051,"d":"6,914"},{"v":1500,"d":"1,500"},{"v":1610,"d":"1,610"},{"v":1775,"d":"1,775"},{"v":1900,"d":"1,900"},{"v":2050,"d":"2,050"},{"v":2130,"d":"2,130"},{"v":2105,"d":"2,105"},{"v":2015,"d":"2,015"},{"v":2025,"d":"2,025"},{"v":1990,"d":"1,990"},{"v":2010,"d":"2,010"},{"v":1082,"d":"1,082"},{"v":1024,"d":"1,024"},948,873,700,500,500,500,44,19,0,0,485,878,1419,2068,{"v":1085,"d":"1,085"},{"v":1028,"d":"1,028"},951,873,700,500,500,500,{"v":4600,"d":"4,600"},{"v":4524,"d":"4,524"},{"v":4454,"d":"4,454"},{"v":4375,"d":"4,375"},485,891,1435,2086,6,6,6,0,266,254,247,241,4500,4535,4585,4577,{"v":4553,"d":"4,553"},{"v":4502,"d":"4,502"},{"v":4452,"d":"4,452"},{"v":4376,"d":"4,376"},6385,6052,5905,5748,272,260,253,241,{"v":57370,"d":"57,370"},{"v":219982900.04999998,"d":"219,982,900"}]
[120,5,{"$f":"IF('iaith - language'!$K$1=2,VLOOKUP(A12,Text!$A$3:$C$353,2,FALSE),VLOOKUP(A12,Text!$A$3:$C$353,3,FALSE))","v":"Sir Ddinbych"},247,239,214,244,{"v":37770.333333,"d":"37,770"},{"v":83856.94,"d":"83,856.94"},{"v":95330,"d":"95,330"},{"v":75917,"d":"75,917"},{"v":22959,"d":"22,959"},{"v":912126.07,"d":"912,126"},0,{"v":9.4,"d":"9.40"},751,{"v":3940,"d":"3,940"},{"v":1670,"d":"1,670"},{"v":11582,"d":"11,582"},{"v":1249,"d":"1,249"},{"v":9559,"d":"9,559"},{"v":9544848,"d":"9,544,848"},0,{"v":7192.301040524326,"d":"7,192"},{"v":4375.391169810584,"d":"4,375"},{"v":1430,"d":"1,430"},{"v":1515,"d":"1,515"},{"v":1565,"d":"1,565"},{"v":1640,"d":"1,640"},{"v":1755,"d":"1,755"},{"v":1760,"d":"1,760"},{"v":1790,"d":"1,790"},{"v":1760,"d":"1,760"},{"v":1825,"d":"1,825"},{"v":1810,"d":"1,810"},{"v":1815,"d":"1,815"},{"v":1136,"d":"1,136"},{"v":1058,"d":"1,058"},{"v":1000,"d":"1,000"},931,600,500,300,200,33,9,0,0,586,1050,1553,2030,{"v":1142,"d":"1,142"},{"v":1061,"d":"1,061"},998,933,600,500,300,200,{"v":3973,"d":"3,973"},{"v":3925,"d":"3,925"},{"v":3862,"d":"3,862"},{"v":3788,"d":"3,788"},587,1056,1565,2050,9,0,0,0,291,288,271,259,4417,4473,4558,4527,{"v":3939,"d":"3,939"},{"v":3917,"d":"3,917"},{"v":3862,"d":"3,862"},{"v":3788,"d":"3,788"},5715,5486,5160,4921,300,288,271,259,{"v":44900,"d":"44,900"},{"v":327398828.515,"d":"327,398,829"}]
[121,6,{"$f":"IF('iaith - language'!$K$1=2,VLOOKUP(A13,Text!$A$3:$C$353,2,FALSE),VLOOKUP(A13,Text!$A$3:$C$353,3,FALSE))","v":"Sir y Fflint"},299,276,274,306,{"v":58597.333333,"d":"58,597"},{"v":43972.394,"d":"43,972.39"},{"v":155593,"d":"155,593"},{"v":123396,"d":"123,396"},{"v":32652,"d":"32,652"},{"v":615580,"d":"615,580"},0,2.31,523,{"v":5030,"d":"5,030"},{"v":1710,"d":"1,710"},{"v":20391,"d":"20,391"},{"v":1529,"d":"1,529"},{"v":10752,"d":"10,752"},{"v":10108921,"d":"10,108,921"},8,{"v":3859.108543533951,"d":"3,859"},{"v":2869.7155499270884,"d":"2,870"},{"v":2265,"d":"2,265"},{"v":2240,"d":"2,240"},{"v":2265,"d":"2,265"},{"v":2300,"d":"2,300"},{"v":2440,"d":"2,440"},{"v":2510,"d":"2,510"},{"v":2435,"d":"2,435"},{"v":2470,"d":"2,470"},{"v":2550,"d":"2,550"},{"v":2565,"d":"2,565"},{"v":2595,"d":"2,595"},969,922,842,784,200,100,200,200,32,5,0,0,2505,2847,3113,3519,969,922,842,786,200,100,200,200,{"v":4431,"d":"4,431"},{"v":4364,"d":"4,364"},{"v":4273,"d":"4,273"},{"v":4179,"d":"4,179"},2522,2877,3142,3559,0,0,0,0,1616,1417,1210,1071,4110,4305,4567,4641,{"v":4397,"d":"4,397"},{"v":4354,"d":"4,354"},{"v":4273,"d":"4,273"},{"v":4179,"d":"4,179"},5600,5386,5315,5165,1616,1417,1210,1071,{"v":69130,"d":"69,130"},{"v":506239907.689,"d":"506,239,908"}]
[122,7,{"$f":"IF('iaith - language'!$K$1=2,VLOOKUP(A14,Text!$A$3:$C$353,2,FALSE),VLOOKUP(A14,Text!$A$3:$C$353,3,FALSE))","v":"Wrecsam"},250,249,233,222,{"v":47427.666667,"d":"47,428"},{"v":50377.349,"d":"50,377.35"},{"v":136126,"d":"136,126"},{"v":106926,"d":"106,926"},{"v":26959,"d":"26,959"},{"v":1653046.29,"d":"1,653,046"},0,{"v":0,"d":"0.00"},473,{"v":3990,"d":"3,990"},{"v":1450,"d":"1,450"},{"v":13159,"d":"13,159"},{"v":1455,"d":"1,455"},{"v":11445,"d":"11,445"},{"v":9933453,"d":"9,933,453"},0,{"v":1110.7945044905741,"d":"1,111"},{"v":1523.1597603177415,"d":"1,523"},{"v":2245,"d":"2,245"},{"v":2270,"d":"2,270"},{"v":2250,"d":"2,250"},{"v":2320,"d":"2,320"},{"v":2370,"d":"2,370"},{"v":2435,"d":"2,435"},{"v":2465,"d":"2,465"},{"v":2480,"d":"2,480"},{"v":2535,"d":"2,535"},{"v":2525,"d":"2,525"},{"v":2545,"d":"2,545"},{"v":1333,"d":"1,333"},{"v":1240,"d":"1,240"},{"v":1158,"d":"1,158"},{"v":1100,"d":"1,100"},400,300,200,200,35,15,0,0,1937,2521,2949,3326,{"v":1335,"d":"1,335"},{"v":1240,"d":"1,240"},{"v":1158,"d":"1,158"},{"v":1100,"d":"1,100"},400,300,200,200,{"v":4306,"d":"4,306"},{"v":4230,"d":"4,230"},{"v":4144,"d":"4,144"},{"v":4049,"d":"4,049"},1949,2547,2975,3358,0,0,0,0,320,291,291,282,5177,5179,5226,5253,{"v":4273,"d":"4,273"},{"v":4211,"d":"4,211"},{"v":4138,"d":"4,138"},{"v":4049,"d":"4,049"},6041,5770,5502,5349,320,291,291,282,{"v":60550,"d":"60,550"},{"v":260551798.91099998,"d":"260,551,799"}]
[123,8,{"$f":"IF('iaith - language'!$K$1=2,VLOOKUP(A15,Text!$A$3:$C$353,2,FALSE),VLOOKUP(A15,Text!$A$3:$C$353,3,FALSE))","v":"Powys"},356,341,351,371,{"v":56296,"d":"56,296"},{"v":519531.211999999,"d":"519,531.21"},{"v":132447,"d":"132,447"},{"v":108417,"d":"108,417"},{"v":35775,"d":"35,775"},{"v":535268.13,"d":"535,268"},{"v":44427,"d":"44,427"},{"v":0,"d":"0.00"},{"v":3871,"d":"3,871"},{"v":6330,"d":"6,330"},{"v":2540,"d":"2,540"},{"v":15052,"d":"15,052"},{"v":1700,"d":"1,700"},{"v":9233,"d":"9,233"},{"v":8918831,"d":"8,918,831"},0,{"v":7981.858532757753,"d":"7,982"},{"v":3055.13908480638,"d":"3,055"},680,665,770,850,975,{"v":1050,"d":"1,050"},{"v":1090,"d":"1,090"},{"v":1130,"d":"1,130"},{"v":1185,"d":"1,185"},{"v":1140,"d":"1,140"},{"v":1205,"d":"1,205"},743,747,706,633,300,300,300,300,31,15,0,0,260,239,387,888,756,755,716,644,300,300,300,300,{"v":4158,"d":"4,158"},{"v":4066,"d":"4,066"},{"v":4006,"d":"4,006"},{"v":3945,"d":"3,945"},260,239,387,900,6,0,0,0,1246,861,677,647,3238,3596,3722,3817,{"v":4128,"d":"4,128"},{"v":4056,"d":"4,056"},{"v":4005,"d":"4,005"},{"v":3945,"d":"3,945"},5214,5121,5022,4889,1252,861,677,647,{"v":64850,"d":"64,850"},{"v":230710315.91,"d":"230,710,316"}]
[124,9,{"$f":"IF('iaith - language'!$K$1=2,VLOOKUP(A16,Text!$A$3:$C$353,2,FALSE),VLOOKUP(A16,Text!$A$3:$C$353,3,FALSE))","v":"Sir Ceredigion"},246,252,266,222,{"v":32217,"d":"32,217"},{"v":178890.874,"d":"178,890.87"},{"v":72992,"d":"72,992"},{"v":60670,"d":"60,670"},{"v":18195,"d":"18,195"},{"v":781341,"d":"781,341"},{"v":10504,"d":"10,504"},{"v":12.915,"d":"12.92"},{"v":1935,"d":"1,935"},{"v":3580,"d":"3,580"},{"v":1370,"d":"1,370"},{"v":6787,"d":"6,787"},862,{"v":5716,"d":"5,716"},{"v":5406442,"d":"5,406,442"},0,{"v":6653.000010788464,"d":"6,653"},{"v":1522.8102352393585,"d":"1,523"},395,435,455,515,565,610,650,650,670,665,730,412,429,431,393,100,300,200,300,13,5,0,0,145,129,131,369,416,433,432,393,100,300,200,300,{"v":2309,"d":"2,309"},{"v":2286,"d":"2,286"},{"v":2236,"d":"2,236"},{"v":2193,"d":"2,193"},145,129,131,373,0,0,0,0,499,412,396,375,2160,2236,2270,2307,{"v":2295,"d":"2,295"},{"v":2281,"d":"2,281"},{"v":2236,"d":"2,236"},{"v":2193,"d":"2,193"},2825,3019,2868,2886,499,412,396,375,{"v":35550,"d":"35,550"},{"v":154808031.565,"d":"154,808,032"}]
[125,10,{"$f":"IF('iaith - language'!$K$1=2,VLOOKUP(A17,Text!$A$3:$C$353,2,FALSE),VLOOKUP(A17,Text!$A$3:$C$353,3,FALSE))","v":"Sir Benfro"},250,251,275,232,{"v":54494,"d":"54,494"},{"v":161834.46000000002,"d":"161,834.46"},{"v":125055,"d":"125,055"},{"v":100995,"d":"100,995"},{"v":32130,"d":"32,130"},{"v":1011884,"d":"1,011,884"},0,{"v":12.3,"d":"12.30"},{"v":1773,"d":"1,773"},{"v":6650,"d":"6,650"},{"v":2230,"d":"2,230"},{"v":15726,"d":"15,726"},{"v":1487,"d":"1,487"},{"v":10487,"d":"10,487"},{"v":8529024,"d":"8,529,024"},{"v":2607,"d":"2,607"},{"v":13578.655302265475,"d":"13,579"},{"v":1995.3177437417191,"d":"1,995"},{"v":1315,"d":"1,315"},{"v":1415,"d":"1,415"},{"v":1655,"d":"1,655"},{"v":1825,"d":"1,825"},{"v":1865,"d":"1,865"},{"v":1930,"d":"1,930"},{"v":1900,"d":"1,900"},{"v":1840,"d":"1,840"},{"v":1845,"d":"1,845"},{"v":1860,"d":"1,860"},{"v":1890,"d":"1,890"},{"v":1219,"d":"1,219"},{"v":1193,"d":"1,193"},{"v":1095,"d":"1,095"},{"v":1011,"d":"1,011"},900,{"v":1000,"d":"1,000"},800,700,30,10,0,0,397,336,734,1560,{"v":1235,"d":"1,235"},{"v":1205,"d":"1,205"},{"v":1104,"d":"1,104"},{"v":1023,"d":"1,023"},900,{"v":1000,"d":"1,000"},800,700,{"v":4358,"d":"4,358"},{"v":4312,"d":"4,312"},{"v":4270,"d":"4,270"},{"v":4195,"d":"4,195"},397,336,740,1574,0,0,0,0,369,355,340,332,4692,4754,4847,4864,{"v":4321,"d":"4,321"},{"v":4306,"d":"4,306"},{"v":4270,"d":"4,270"},{"v":4195,"d":"4,195"},6493,6517,6174,5918,369,355,340,332,{"v":61590,"d":"61,590"},{"v":261655324.101,"d":"261,655,324"}]
[126,11,{"$f":"IF('iaith - language'!$K$1=2,VLOOKUP(A18,Text!$A$3:$C$353,2,FALSE),VLOOKUP(A18,Text!$A$3:$C$353,3,FALSE))","v":"Sir Gaerfyrddin"},407,335,311,354,{"v":75836.666667,"d":"75,837"},{"v":237110.391999999,"d":"237,110.39"},{"v":187568,"d":"187,568"},{"v":150166,"d":"150,166"},{"v":44011,"d":"44,011"},{"v":2277126.94,"d":"2,277,127"},0,9.06,{"v":3097,"d":"3,097"},{"v":6680,"d":"6,680"},{"v":2700,"d":"2,700"},{"v":20464,"d":"20,464"},{"v":2374,"d":"2,374"},{"v":16007,"d":"16,007"},{"v":15099868,"d":"15,099,868"},0,{"v":4062.348820638414,"d":"4,062"},{"v":2273.8883320595282,"d":"2,274"},{"v":1950,"d":"1,950"},{"v":1995,"d":"1,995"},{"v":1995,"d":"1,995"},{"v":2110,"d":"2,110"},{"v":2175,"d":"2,175"},{"v":2315,"d":"2,315"},{"v":2420,"d":"2,420"},{"v":2525,"d":"2,525"},{"v":2725,"d":"2,725"},{"v":2780,"d":"2,780"},{"v":2885,"d":"2,885"},{"v":1632,"d":"1,632"},{"v":1666,"d":"1,666"},{"v":1634,"d":"1,634"},{"v":1529,"d":"1,529"},{"v":1500,"d":"1,500"},{"v":1500,"d":"1,500"},{"v":1400,"d":"1,400"},{"v":1700,"d":"1,700"},66,22,7,0,613,558,525,1134,{"v":1656,"d":"1,656"},{"v":1690,"d":"1,690"},{"v":1663,"d":"1,663"},{"v":1544,"d":"1,544"},{"v":1500,"d":"1,500"},{"v":1500,"d":"1,500"},{"v":1400,"d":"1,400"},{"v":1700,"d":"1,700"},{"v":6512,"d":"6,512"},{"v":6457,"d":"6,457"},{"v":6365,"d":"6,365"},{"v":6235,"d":"6,235"},613,561,524,1143,5,0,0,0,680,659,640,611,7873,7992,8136,8213,{"v":6448,"d":"6,448"},{"v":6432,"d":"6,432"},{"v":6360,"d":"6,360"},{"v":6234,"d":"6,234"},9668,9647,9428,9479,685,659,640,611,{"v":87920,"d":"87,920"},{"v":486977790.878,"d":"486,977,791"}]
[127,12,{"$f":"IF('iaith - language'!$K$1=2,VLOOKUP(A19,Text!$A$3:$C$353,2,FALSE),VLOOKUP(A19,Text!$A$3:$C$353,3,FALSE))","v":"Abertawe"},554,495,488,556,{"v":90699,"d":"90,699"},{"v":37759.64099999991,"d":"37,759.64"},{"v":246466,"d":"246,466"},{"v":199277,"d":"199,277"},{"v":48049,"d":"48,049"},{"v":4125956,"d":"4,125,956"},0,{"v":7.9,"d":"7.90"},385,{"v":7460,"d":"7,460"},{"v":2930,"d":"2,930"},{"v":28642,"d":"28,642"},{"v":2634,"d":"2,634"},{"v":22438,"d":"22,438"},{"v":20310694,"d":"20,310,694"},139,{"v":5167.18360192536,"d":"5,167"},{"v":3174.5066902124845,"d":"3,175"},{"v":4885,"d":"4,885"},{"v":4830,"d":"4,830"},{"v":4800,"d":"4,800"},{"v":4960,"d":"4,960"},{"v":5150,"d":"5,150"},{"v":5285,"d":"5,285"},{"v":5285,"d":"5,285"},{"v":5245,"d":"5,245"},{"v":5285,"d":"5,285"},{"v":5290,"d":"5,290"},{"v":5385,"d":"5,385"},{"v":2388,"d":"2,388"},{"v":2230,"d":"2,230"},{"v":2066,"d":"2,066"},{"v":1914,"d":"1,914"},900,700,600,600,58,18,5,0,3516,4570,5389,6347,{"v":2400,"d":"2,400"},{"v":2235,"d":"2,235"},{"v":2065,"d":"2,065"},{"v":1921,"d":"1,921"},900,700,600,600,{"v":8087,"d":"8,087"},{"v":7969,"d":"7,969"},{"v":7866,"d":"7,866"},{"v":7712,"d":"7,712"},3561,4627,5453,6418,6,0,0,0,890,825,786,760,10652,10818,10987,11033,{"v":8029,"d":"8,029"},{"v":7953,"d":"7,953"},{"v":7864,"d":"7,864"},{"v":7711,"d":"7,711"},11387,10904,10531,10233,896,825,786,760,{"v":113050,"d":"113,050"},{"v":616853135.599,"d":"616,853,136"}]
[128,13,{"$f":"IF('iaith - language'!$K$1=2,VLOOKUP(A20,Text!$A$3:$C$353,2,FALSE),VLOOKUP(A20,Text!$A$3:$C$353,3,FALSE))","v":"Castell-nedd Port Talbot"},228,196,161,214,{"v":53222.666667,"d":"53,223"},{"v":44229.601,"d":"44,229.60"},{"v":142906,"d":"142,906"},{"v":114862,"d":"114,862"},{"v":29530,"d":"29,530"},{"v":2932569,"d":"2,932,569"},0,{"v":2.9,"d":"2.90"},225,{"v":3880,"d":"3,880"},{"v":1780,"d":"1,780"},{"v":19139,"d":"19,139"},{"v":1709,"d":"1,709"},{"v":17067,"d":"17,067"},{"v":17307947,"d":"17,307,947"},173,{"v":858.6198271811288,"d":"859"},{"v":1161.909077692776,"d":"1,162"},{"v":2885,"d":"2,885"},{"v":2840,"d":"2,840"},{"v":2815,"d":"2,815"},{"v":2870,"d":"2,870"},{"v":3000,"d":"3,000"},{"v":3045,"d":"3,045"},{"v":2985,"d":"2,985"},{"v":3020,"d":"3,020"},{"v":3000,"d":"3,000"},{"v":2940,"d":"2,940"},{"v":3010,"d":"3,010"},{"v":1823,"d":"1,823"},{"v":1738,"d":"1,738"},{"v":1605,"d":"1,605"},{"v":1514,"d":"1,514"},300,300,300,300,56,23,0,0,2769,3236,3682,4301,{"v":1829,"d":"1,829"},{"v":1743,"d":"1,743"},{"v":1602,"d":"1,602"},{"v":1522,"d":"1,522"},300,300,300,300,{"v":5535,"d":"5,535"},{"v":5470,"d":"5,470"},{"v":5396,"d":"5,396"},{"v":5269,"d":"5,269"},2788,3259,3729,4356,6,0,0,0,725,688,661,635,8082,8216,8352,8420,{"v":5483,"d":"5,483"},{"v":5451,"d":"5,451"},{"v":5396,"d":"5,396"},{"v":5269,"d":"5,269"},7664,7513,7298,7091,731,688,661,635,{"v":66410,"d":"66,410"},{"v":396951277.313,"d":"396,951,277"}]
[129,14,{"$f":"IF('iaith - language'!$K$1=2,VLOOKUP(A21,Text!$A$3:$C$353,2,FALSE),VLOOKUP(A21,Text!$A$3:$C$353,3,FALSE))","v":"Pen-y-bont ar Ogwr"},274,227,221,237,{"v":55674,"d":"55,674"},{"v":25071.250000000004,"d":"25,071.25"},{"v":144876,"d":"144,876"},{"v":115505,"d":"115,505"},{"v":29379,"d":"29,379"},{"v":1898932.87,"d":"1,898,933"},0,2.35,193,{"v":4950,"d":"4,950"},{"v":1780,"d":"1,780"},{"v":20245,"d":"20,245"},{"v":1641,"d":"1,641"},{"v":13336,"d":"13,336"},{"v":14084287,"d":"14,084,287"},0,{"v":2524.565879239809,"d":"2,525"},{"v":3087.5044132967005,"d":"3,088"},{"v":1970,"d":"1,970"},{"v":2120,"d":"2,120"},{"v":2145,"d":"2,145"},{"v":2265,"d":"2,265"},{"v":2350,"d":"2,350"},{"v":2415,"d":"2,415"},{"v":2395,"d":"2,395"},{"v":2415,"d":"2,415"},{"v":2445,"d":"2,445"},{"v":2405,"d":"2,405"},{"v":2500,"d":"2,500"},{"v":1873,"d":"1,873"},{"v":1762,"d":"1,762"},{"v":1603,"d":"1,603"},{"v":1506,"d":"1,506"},{"v":1200,"d":"1,200"},900,600,500,34,16,0,0,543,1123,2028,2821,{"v":1896,"d":"1,896"},{"v":1777,"d":"1,777"},{"v":1616,"d":"1,616"},{"v":1515,"d":"1,515"},{"v":1200,"d":"1,200"},900,600,500,{"v":4412,"d":"4,412"},{"v":4358,"d":"4,358"},{"v":4277,"d":"4,277"},{"v":4196,"d":"4,196"},543,1135,2050,2847,5,0,0,0,2548,2349,2248,2045,5064,5240,5439,5795,{"v":4373,"d":"4,373"},{"v":4340,"d":"4,340"},{"v":4277,"d":"4,277"},{"v":4196,"d":"4,196"},7508,7035,6493,6211,2553,2349,2248,2045,{"v":64590,"d":"64,590"},{"v":475683450.93,"d":"475,683,451"}]
[130,15,{"$f":"IF('iaith - language'!$K$1=2,VLOOKUP(A22,Text!$A$3:$C$353,2,FALSE),VLOOKUP(A22,Text!$A$3:$C$353,3,FALSE))","v":"Bro Morgannwg"},393,303,331,351,{"v":51918.333333,"d":"51,918"},{"v":33106.088999999905,"d":"33,106.09"},{"v":132165,"d":"132,165"},{"v":104755,"d":"104,755"},{"v":27691,"d":"27,691"},{"v":1037676.54,"d":"1,037,677"},0,{"v":4,"d":"4.00"},303,{"v":3390,"d":"3,390"},{"v":1500,"d":"1,500"},{"v":15785,"d":"15,785"},{"v":1309,"d":"1,309"},{"v":9558,"d":"9,558"},{"v":9670925,"d":"9,670,925"},75,{"v":2073.858853147477,"d":"2,074"},{"v":3655.428879633212,"d":"3,655"},{"v":1105,"d":"1,105"},{"v":1105,"d":"1,105"},{"v":1235,"d":"1,235"},{"v":1405,"d":"1,405"},{"v":1535,"d":"1,535"},{"v":1585,"d":"1,585"},{"v":1600,"d":"1,600"},{"v":1630,"d":"1,630"},{"v":1735,"d":"1,735"},{"v":1765,"d":"1,765"},{"v":1835,"d":"1,835"},{"v":1202,"d":"1,202"},{"v":1235,"d":"1,235"},{"v":1172,"d":"1,172"},{"v":1070,"d":"1,070"},800,800,600,600,30,7,0,0,352,310,464,1232,{"v":1214,"d":"1,214"},{"v":1248,"d":"1,248"},{"v":1179,"d":"1,179"},{"v":1071,"d":"1,071"},800,800,600,600,{"v":3450,"d":"3,450"},{"v":3401,"d":"3,401"},{"v":3341,"d":"3,341"},{"v":3277,"d":"3,277"},352,310,468,1243,0,0,0,0,1654,1521,1452,1347,3112,3256,3426,3677,{"v":3419,"d":"3,419"},{"v":3391,"d":"3,391"},{"v":3341,"d":"3,341"},{"v":3277,"d":"3,277"},5464,5449,5120,4948,1654,1521,1452,1347,{"v":58920,"d":"58,920"},{"v":361881138.03999996,"d":"361,881,138"}]
[131,16,{"$f":"IF('iaith - language'!$K$1=2,VLOOKUP(A23,Text!$A$3:$C$353,2,FALSE),VLOOKUP(A23,Text!$A$3:$C$353,3,FALSE))","v":"Rhondda Cynon Taf"},384,328,295,314,{"v":92801.666667,"d":"92,802"},{"v":42415.042,"d":"42,415.04"},{"v":240131,"d":"240,131"},{"v":190143,"d":"190,143"},{"v":45994,"d":"45,994"},{"v":3175110.26,"d":"3,175,110"},0,{"v":0,"d":"0.00"},272,{"v":6620,"d":"6,620"},{"v":3060,"d":"3,060"},{"v":29510,"d":"29,510"},{"v":2600,"d":"2,600"},{"v":24866,"d":"24,866"},{"v":23037181,"d":"23,037,181"},0,{"v":1232.91597509996,"d":"1,233"},{"v":1603.0094787476107,"d":"1,603"},{"v":3035,"d":"3,035"},{"v":2920,"d":"2,920"},{"v":2930,"d":"2,930"},{"v":3285,"d":"3,285"},{"v":3615,"d":"3,615"},{"v":3910,"d":"3,910"},{"v":4015,"d":"4,015"},{"v":4140,"d":"4,140"},{"v":4300,"d":"4,300"},{"v":4340,"d":"4,340"},{"v":4545,"d":"4,545"},{"v":3481,"d":"3,481"},{"v":3470,"d":"3,470"},{"v":3350,"d":"3,350"},{"v":3054,"d":"3,054"},{"v":1800,"d":"1,800"},{"v":1800,"d":"1,800"},{"v":1800,"d":"1,800"},{"v":1600,"d":"1,600"},75,22,0,0,944,863,805,2525,{"v":3515,"d":"3,515"},{"v":3501,"d":"3,501"},{"v":3383,"d":"3,383"},{"v":3079,"d":"3,079"},{"v":1800,"d":"1,800"},{"v":1800,"d":"1,800"},{"v":1900,"d":"1,900"},{"v":1600,"d":"1,600"},{"v":8832,"d":"8,832"},{"v":8714,"d":"8,714"},{"v":8567,"d":"8,567"},{"v":8356,"d":"8,356"},944,861,809,2549,0,0,0,0,4591,4191,4021,3664,8825,9176,9496,10220,{"v":8760,"d":"8,760"},{"v":8687,"d":"8,687"},{"v":8567,"d":"8,567"},{"v":8356,"d":"8,356"},14147,14015,13850,13035,4591,4191,4021,3664,{"v":109750,"d":"109,750"},{"v":729078645.303,"d":"729,078,645"}]
[132,17,{"$f":"IF('iaith - language'!$K$1=2,VLOOKUP(A24,Text!$A$3:$C$353,2,FALSE),VLOOKUP(A24,Text!$A$3:$C$353,3,FALSE))","v":"Merthyr Tudful"},101,106,96,84,{"v":21159.666667,"d":"21,160"},{"v":11195.7019999999,"d":"11,195.70"},{"v":60183,"d":"60,183"},{"v":47369,"d":"47,369"},{"v":11224,"d":"11,224"},{"v":576183.23,"d":"576,183"},0,{"v":0,"d":"0.00"},51,{"v":1750,"d":"1,750"},780,{"v":7436,"d":"7,436"},678,{"v":6399,"d":"6,399"},{"v":5994302,"d":"5,994,302"},0,{"v":497.10041960373997,"d":"497"},{"v":1297.175335681343,"d":"1,297"},990,{"v":1065,"d":"1,065"},{"v":1150,"d":"1,150"},{"v":1210,"d":"1,210"},{"v":1300,"d":"1,300"},{"v":1335,"d":"1,335"},{"v":1335,"d":"1,335"},{"v":1365,"d":"1,365"},{"v":1395,"d":"1,395"},{"v":1375,"d":"1,375"},{"v":1410,"d":"1,410"},952,927,842,776,400,500,300,300,22,8,0,0,302,512,906,1378,962,934,849,780,400,500,300,300,{"v":2223,"d":"2,223"},{"v":2190,"d":"2,190"},{"v":2152,"d":"2,152"},{"v":2113,"d":"2,113"},302,515,913,1396,0,0,0,0,1385,1273,1208,1104,2386,2494,2601,2829,{"v":2203,"d":"2,203"},{"v":2181,"d":"2,181"},{"v":2152,"d":"2,152"},{"v":2113,"d":"2,113"},3585,3624,3301,3193,1385,1273,1208,1104,{"v":27370,"d":"27,370"},{"v":65252280.717,"d":"65,252,281"}]
[133,18,{"$f":"IF('iaith - language'!$K$1=2,VLOOKUP(A25,Text!$A$3:$C$353,2,FALSE),VLOOKUP(A25,Text!$A$3:$C$353,3,FALSE))","v":"Caerffili"},244,226,199,218,{"v":64440.333333,"d":"64,440"},{"v":27738.7809999999,"d":"27,738.78"},{"v":181019,"d":"181,019"},{"v":142914,"d":"142,914"},{"v":34992,"d":"34,992"},{"v":1066369.5,"d":"1,066,370"},0,{"v":0,"d":"0.00"},240,{"v":4650,"d":"4,650"},{"v":2060,"d":"2,060"},{"v":27585,"d":"27,585"},{"v":1877,"d":"1,877"},{"v":17320,"d":"17,320"},{"v":13798515,"d":"13,798,515"},0,{"v":925.8104850484515,"d":"926"},{"v":1383.2980840116356,"d":"1,383"},{"v":2420,"d":"2,420"},{"v":2555,"d":"2,555"},{"v":2835,"d":"2,835"},{"v":2995,"d":"2,995"},{"v":3240,"d":"3,240"},{"v":3370,"d":"3,370"},{"v":3405,"d":"3,405"},{"v":3425,"d":"3,425"},{"v":3475,"d":"3,475"},{"v":3530,"d":"3,530"},{"v":3615,"d":"3,615"},{"v":2367,"d":"2,367"},{"v":2351,"d":"2,351"},{"v":2167,"d":"2,167"},{"v":1997,"d":"1,997"},{"v":1900,"d":"1,900"},{"v":1600,"d":"1,600"},{"v":1300,"d":"1,300"},{"v":1300,"d":"1,300"},69,31,0,0,896,808,1510,2829,{"v":2382,"d":"2,382"},{"v":2369,"d":"2,369"},{"v":2175,"d":"2,175"},{"v":2000,"d":"2,000"},{"v":1900,"d":"1,900"},{"v":1600,"d":"1,600"},{"v":1300,"d":"1,300"},{"v":1300,"d":"1,300"},{"v":6524,"d":"6,524"},{"v":6424,"d":"6,424"},{"v":6327,"d":"6,327"},{"v":6206,"d":"6,206"},896,808,1522,2853,0,0,0,0,2649,2435,2338,2172,7473,7696,7936,8341,{"v":6458,"d":"6,458"},{"v":6389,"d":"6,389"},{"v":6327,"d":"6,327"},{"v":6206,"d":"6,206"},10806,10393,9802,9506,2649,2435,2338,2172,{"v":79300,"d":"79,300"},{"v":535664716.31000006,"d":"535,664,716"}]
[134,19,{"$f":"IF('iaith - language'!$K$1=2,VLOOKUP(A26,Text!$A$3:$C$353,2,FALSE),VLOOKUP(A26,Text!$A$3:$C$353,3,FALSE))","v":"Blaenau Gwent"},91,73,79,68,{"v":24906.666667,"d":"24,907"},{"v":10872.805,"d":"10,872.81"},{"v":69713,"d":"69,713"},{"v":56106,"d":"56,106"},{"v":13932,"d":"13,932"},{"v":366171,"d":"366,171"},0,{"v":0,"d":"0.00"},72,{"v":2070,"d":"2,070"},{"v":1080,"d":"1,080"},{"v":12860,"d":"12,860"},844,{"v":8753,"d":"8,753"},{"v":8630824,"d":"8,630,824"},0,{"v":388.46267669447957,"d":"388"},{"v":558.2327692332735,"d":"558"},{"v":1170,"d":"1,170"},{"v":1240,"d":"1,240"},{"v":1340,"d":"1,340"},{"v":1405,"d":"1,405"},{"v":1520,"d":"1,520"},{"v":1585,"d":"1,585"},{"v":1580,"d":"1,580"},{"v":1565,"d":"1,565"},{"v":1620,"d":"1,620"},{"v":1615,"d":"1,615"},{"v":1690,"d":"1,690"},{"v":1063,"d":"1,063"},{"v":1034,"d":"1,034"},932,853,700,700,500,500,27,9,0,0,381,444,973,1552,{"v":1064,"d":"1,064"},{"v":1040,"d":"1,040"},934,858,700,700,500,500,{"v":2942,"d":"2,942"},{"v":2888,"d":"2,888"},{"v":2836,"d":"2,836"},{"v":2787,"d":"2,787"},381,446,977,1571,0,0,0,0,608,588,559,544,3539,3638,3731,3838,{"v":2913,"d":"2,913"},{"v":2881,"d":"2,881"},{"v":2836,"d":"2,836"},{"v":2787,"d":"2,787"},4706,4628,4270,4145,608,588,559,544,{"v":32760,"d":"32,760"},{"v":190074320.872,"d":"190,074,321"}]
[135,20,{"$f":"IF('iaith - language'!$K$1=2,VLOOKUP(A27,Text!$A$3:$C$353,2,FALSE),VLOOKUP(A27,Text!$A$3:$C$353,3,FALSE))","v":"Torfaen"},158,126,139,146,{"v":31817,"d":"31,817"},{"v":12623.993,"d":"12,623.99"},{"v":93049,"d":"93,049"},{"v":73818,"d":"73,818"},{"v":18973,"d":"18,973"},{"v":1252921.86,"d":"1,252,922"},0,{"v":0,"d":"0.00"},120,{"v":2770,"d":"2,770"},{"v":1210,"d":"1,210"},{"v":13621,"d":"13,621"},{"v":1010,"d":"1,010"},{"v":9985,"d":"9,985"},{"v":8796655,"d":"8,796,655"},0,{"v":475.564237257777,"d":"476"},{"v":890.6098855324522,"d":"891"},{"v":1980,"d":"1,980"},{"v":1960,"d":"1,960"},{"v":1925,"d":"1,925"},{"v":1955,"d":"1,955"},{"v":2065,"d":"2,065"},{"v":2055,"d":"2,055"},{"v":1985,"d":"1,985"},{"v":1990,"d":"1,990"},{"v":1990,"d":"1,990"},{"v":1960,"d":"1,960"},{"v":1980,"d":"1,980"},869,824,759,691,200,100,100,100,33,14,0,0,2423,2666,2914,3266,871,823,759,698,200,100,100,100,{"v":3138,"d":"3,138"},{"v":3095,"d":"3,095"},{"v":3039,"d":"3,039"},{"v":2995,"d":"2,995"},2441,2685,2938,3300,0,0,0,0,689,647,627,596,4169,4275,4395,4500,{"v":3110,"d":"3,110"},{"v":3087,"d":"3,087"},{"v":3039,"d":"3,039"},{"v":2995,"d":"2,995"},4209,4018,3898,3793,689,647,627,596,{"v":41840,"d":"41,840"},{"v":169782391.817,"d":"169,782,392"}]
[136,21,{"$f":"IF('iaith - language'!$K$1=2,VLOOKUP(A28,Text!$A$3:$C$353,2,FALSE),VLOOKUP(A28,Text!$A$3:$C$353,3,FALSE))","v":"Sir Fynwy"},279,284,281,282,{"v":36541.666667,"d":"36,542"},{"v":85026.45800000001,"d":"85,026.46"},{"v":94142,"d":"94,142"},{"v":76569,"d":"76,569"},{"v":23424,"d":"23,424"},{"v":633440,"d":"633,440"},{"v":93511,"d":"93,511"},{"v":0,"d":"0.00"},{"v":1020,"d":"1,020"},{"v":3050,"d":"3,050"},{"v":1230,"d":"1,230"},{"v":10945,"d":"10,945"},{"v":1022,"d":"1,022"},{"v":5690,"d":"5,690"},{"v":6160326,"d":"6,160,326"},0,{"v":1377.6825761386322,"d":"1,378"},{"v":1706.6814614692194,"d":"1,707"},750,785,785,780,850,855,880,865,860,900,920,517,491,442,398,300,300,200,200,16,11,0,0,221,345,712,912,517,494,441,399,300,300,200,200,{"v":2222,"d":"2,222"},{"v":2205,"d":"2,205"},{"v":2158,"d":"2,158"},{"v":2115,"d":"2,115"},221,346,716,929,0,0,0,0,466,438,418,410,2490,2533,2560,2579,{"v":2204,"d":"2,204"},{"v":2197,"d":"2,197"},{"v":2157,"d":"2,157"},{"v":2111,"d":"2,111"},3039,2999,2799,2714,466,438,418,410,{"v":42160,"d":"42,160"},{"v":151721218.54500002,"d":"151,721,219"}]
[137,22,{"$f":"IF('iaith - language'!$K$1=2,VLOOKUP(A29,Text!$A$3:$C$353,2,FALSE),VLOOKUP(A29,Text!$A$3:$C$353,3,FALSE))","v":"Casnewydd"},273,269,239,273,{"v":55074.666667,"d":"55,075"},{"v":19037.2839999999,"d":"19,037.28"},{"v":153302,"d":"153,302"},{"v":118372,"d":"118,372"},{"v":26468,"d":"26,468"},{"v":903542.42,"d":"903,542"},{"v":754568,"d":"754,568"},{"v":0,"d":"0.00"},144,{"v":4500,"d":"4,500"},{"v":1870,"d":"1,870"},{"v":19832,"d":"19,832"},{"v":1523,"d":"1,523"},{"v":13506,"d":"13,506"},{"v":10909877,"d":"10,909,877"},546,{"v":1621.431478441305,"d":"1,621"},{"v":3973.0075952185393,"d":"3,973"},{"v":3490,"d":"3,490"},{"v":3490,"d":"3,490"},{"v":3480,"d":"3,480"},{"v":3535,"d":"3,535"},{"v":3675,"d":"3,675"},{"v":3710,"d":"3,710"},{"v":3675,"d":"3,675"},{"v":3705,"d":"3,705"},{"v":3800,"d":"3,800"},{"v":3830,"d":"3,830"},{"v":3880,"d":"3,880"},{"v":1687,"d":"1,687"},{"v":1592,"d":"1,592"},{"v":1462,"d":"1,462"},{"v":1371,"d":"1,371"},900,700,500,500,41,25,0,0,2808,3532,3978,4552,{"v":1694,"d":"1,694"},{"v":1592,"d":"1,592"},{"v":1462,"d":"1,462"},{"v":1373,"d":"1,373"},900,700,500,500,{"v":4668,"d":"4,668"},{"v":4612,"d":"4,612"},{"v":4571,"d":"4,571"},{"v":4489,"d":"4,489"},2841,3571,4011,4604,7,0,0,0,943,887,849,824,5722,5882,6051,6203,{"v":4624,"d":"4,624"},{"v":4586,"d":"4,586"},{"v":4566,"d":"4,566"},{"v":4489,"d":"4,489"},7262,6904,6533,6362,950,887,849,824,{"v":68800,"d":"68,800"},{"v":352865939.172,"d":"352,865,939"}]
[138,23,{"$f":"IF('iaith - language'!$K$1=2,VLOOKUP(A30,Text!$A$3:$C$353,2,FALSE),VLOOKUP(A30,Text!$A$3:$C$353,3,FALSE))","v":"Caerdydd"},735,645,647,745,{"v":126882.333333,"d":"126,882"},{"v":14229.894,"d":"14,229.89"},{"v":364248,"d":"364,248"},{"v":289613,"d":"289,613"},{"v":51339,"d":"51,339"},{"v":5678097.26,"d":"5,678,097"},{"v":139318,"d":"139,318"},{"v":2.4,"d":"2.40"},56,{"v":12420,"d":"12,420"},{"v":4180,"d":"4,180"},{"v":42377,"d":"42,377"},{"v":2980,"d":"2,980"},{"v":30405,"d":"30,405"},{"v":30142233,"d":"30,142,233"},232,{"v":4190.53732331514,"d":"4,191"},{"v":20100.802639039946,"d":"20,101"},{"v":6265,"d":"6,265"},{"v":6460,"d":"6,460"},{"v":6545,"d":"6,545"},{"v":6770,"d":"6,770"},{"v":7245,"d":"7,245"},{"v":7345,"d":"7,345"},{"v":7275,"d":"7,275"},{"v":7260,"d":"7,260"},{"v":7505,"d":"7,505"},{"v":7330,"d":"7,330"},{"v":7695,"d":"7,695"},{"v":3900,"d":"3,900"},{"v":3620,"d":"3,620"},{"v":3374,"d":"3,374"},{"v":3112,"d":"3,112"},{"v":2900,"d":"2,900"},{"v":2400,"d":"2,400"},{"v":1700,"d":"1,700"},{"v":1500,"d":"1,500"},88,46,13,7,2670,4671,6155,7796,{"v":3914,"d":"3,914"},{"v":3628,"d":"3,628"},{"v":3378,"d":"3,378"},{"v":3119,"d":"3,119"},{"v":2900,"d":"2,900"},{"v":2400,"d":"2,400"},{"v":1700,"d":"1,700"},{"v":1500,"d":"1,500"},{"v":9390,"d":"9,390"},{"v":9253,"d":"9,253"},{"v":9077,"d":"9,077"},{"v":8899,"d":"8,899"},2687,4701,6209,7870,6,0,0,0,4739,4321,4132,3760,9478,9813,10224,10983,{"v":9302,"d":"9,302"},{"v":9209,"d":"9,209"},{"v":9067,"d":"9,067"},{"v":8895,"d":"8,895"},16204,15281,14155,13518,4745,4321,4132,3760,{"v":157340,"d":"157,340"},{"v":926999534.35,"d":"926,999,534"}]
[]
[139,null,{"$f":"IF('iaith - language'!$K$1=2,VLOOKUP(A32,Text!$A$3:$C$353,2,FALSE),VLOOKUP(A32,Text!$A$3:$C$353,3,FALSE))","v":"Cyfanswm AU "},{"$f":"SUM(D9:D30)","v":{"v":6519,"d":"6,519"}},{"v":5939,"d":"5,939"},{"v":5782,"d":"5,782"},{"v":6187,"d":"6,187"},{"$f":"SUM(H9:H30)","v":{"v":1203010.6666680002,"d":"1,203,011"}},{"v":2078169.243999997,"d":"2,078,169"},{"$f":"SUM(J9:J30)","v":{"v":3138631,"d":"3,138,631"}},{"v":2508846,"d":"2,508,846"},{"v":651993,"d":"651,993"},{"v":33870369.690000005,"d":"33,870,370"},{"v":1188849,"d":"1,188,849"},{"v":117.162,"d":"117.16"},{"v":19039,"d":"19039.00"},{"$f":"SUM(Q9:Q30)","v":{"v":108990,"d":"108,990"}},{"$f":"SUM(R9:R30)","v":{"v":42880,"d":"42,880"}},{"$f":"SUM(S9:S30)","v":{"v":395268,"d":"395,268"}},{"$f":"SUM(T9:T30)","v":{"v":34406,"d":"34,406"}},{"$f":"SUM(U9:U30)","v":{"v":277989,"d":"277,989"}},{"v":260666843,"d":"260,666,843"},{"v":6920,"d":"6,920"},{"v":100156.37281273428,"d":"100,156"},{"v":71624.62628251137,"d":"71,625"},{"v":44690,"d":"44,690"},{"v":45490,"d":"45,490"},{"v":46760,"d":"46,760"},{"v":49155,"d":"49,155"},{"v":52150,"d":"52,150"},{"v":53715,"d":"53,715"},{"v":53775,"d":"53,775"},{"v":53940,"d":"53,940"},{"v":55325,"d":"55,325"},{"$f":"SUM(AI9:AI30)","v":{"v":55200,"d":"55,200"}},{"$f":"SUM(AJ9:AJ30)","v":{"v":56780,"d":"56,780"}},{"v":32201,"d":"32,201"},{"v":31122,"d":"31,122"},{"v":29146,"d":"29,146"},{"v":26937,"d":"26,937"},{"v":18000,"d":"18,000"},{"v":16200,"d":"16,200"},{"v":13300,"d":"13,300"},{"v":13300,"d":"13,300"},897,349,25,7,{"v":25407,"d":"25,407"},{"v":32195,"d":"32,195"},{"v":40868,"d":"40,868"},{"v":55701,"d":"55,701"},{"v":32426,"d":"32,426"},{"v":31305,"d":"31,305"},{"v":29281,"d":"29,281"},{"v":27073,"d":"27,073"},{"v":18000,"d":"18,000"},{"v":16200,"d":"16,200"},{"v":13400,"d":"13,400"},{"v":13300,"d":"13,300"},{"v":103125,"d":"103,125"},{"v":101703,"d":"101,703"},{"v":100066,"d":"100,066"},{"v":98090,"d":"98,090"},{"v":25571,"d":"25,571"},{"v":32457,"d":"32,457"},{"v":41238,"d":"41,238"},{"v":56289,"d":"56,289"},56,6,6,0,{"v":27539,"d":"27,539"},{"$f":"SUM(BV9:BV30)","v":{"v":25049,"d":"25,049"}},{"v":23709,"d":"23,709"},{"v":22017,"d":"22,017"},{"v":113034,"d":"113,034"},{"v":116017,"d":"116,017"},{"v":119125,"d":"119,125"},{"v":122600,"d":"122,600"},{"v":102225,"d":"102,225"},{"v":101345,"d":"101,345"},{"v":100034,"d":"100,034"},{"v":98081,"d":"98,081"},{"v":153551,"d":"153,551"},{"v":149208,"d":"149,208"},{"v":142747,"d":"142,747"},{"v":138463,"d":"138,463"},{"v":27595,"d":"27,595"},{"v":25055,"d":"25,055"},{"v":23715,"d":"23,715"},{"v":22017,"d":"22,017"},{"v":1432660,"d":"1,432,660"},{"$f":"SUM(CP9:CP30)","v":{"v":8088077977.924002,"d":"8,088,077,978"}}]
[]
[]
[27,null,65,{"$f":"IF('iaith - language'!K1=2,VLOOKUP(A35,Text!$A$3:$C$353,2),VLOOKUP(A35,Text!$A$3:$C$353,3))","v":"Yr Is-adran Polisi Cyllid Llywodraeth Leol a Chynaliadwyedd, Llywodraeth Cymru"}]
[30,null,66,{"$f":"IF('iaith - language'!K1=2,VLOOKUP(A36,Text!$A$3:$C$353,2),VLOOKUP(A36,Text!$A$3:$C$353,3))","v":"Os oes gennych ymholiadau, cysylltwch â:"}]
[29,null,72,"LGFPSettlement@gov.wales"]
[]
[31,null,67]
[32,null,73]
[]
[33,null,68,{"$f":"IF('iaith - language'!K1=2,VLOOKUP(A42,Text!$A$3:$C$353,2),VLOOKUP(A42,Text!$A$3:$C$353,3))","v":"Nodiadau:"}]
[34,null,69,{"$f":"IF('iaith - language'!K1=2,VLOOKUP(A44,Text!$A$3:$C$353,2,FALSE),VLOOKUP(A44,Text!$A$3:$C$353,3,FALSE))","v":"1 Cafodd y set ddata 'Stoc Anheddau'r Sector Preifat' ei hepgor o'r cyfrifiadau ar gyfer y setliad Grant Cynnal Refeniw, ond mae wedi ei chynnwys yn y fformiwlâu ar gyfer Cyllid Cyfalaf Cyffredinol"}]
[140,141,70,{"$f":"IF('iaith - language'!K1=2,VLOOKUP(B44,Text!$A$3:$C$353,2,FALSE),VLOOKUP(B44,Text!$A$3:$C$353,3,FALSE))","v":".. Nid yw'r eitem ddata yma ar gael"}]
[36,null,71]